{"text_format":"1","workbook":"xlsx","n_sheets":12,"sheets":["Kalender","Jahreskarten","Horoskop","Allg. Jahre","Namensanalyse","Tabelle1","Numerologie","Numerologie 2","Numerologie 3","Astrologie 1","Astrologie 2","Tabelle2"],"not_rendered":{"charts":13,"images":0,"macros":0,"external_links":0,"defined_names":2,"comments":0,"pivot_tables":0},"unopened":[],"bounds":{"document_bytes":16777216,"sheet_cells":100000,"rows_first":2000,"rows_last":500,"rows_between":2000,"halvings":0,"cell_chars":16384,"cell_head_chars":4096},"cells_cut":0,"cells_raw":0,"read":"whole","date_system":"1900"}

{"sheet":"Kalender","index":0,"n_rows":183,"n_cols":26,"rows_kept":183,"cut":false,"hidden":false,"merged":[[57,4,57,5],[57,13,57,14],[57,22,57,23],[23,4,23,5],[3,4,3,5],[7,4,7,5],[23,13,23,14],[23,22,23,23],[91,4,91,5],[91,13,91,14],[91,22,91,23],[125,4,125,5],[125,13,125,14],[125,22,125,23]]}
[]
[]
[]
["Jahr",null,"Jahr","Resultat","Jahreskarte",null,"Konstellation","Gruppe"]
[{"$f":"+A23","v":2023},null,{"$f":"$A$23","v":2023},{"$f":"SUMPRODUCT(MID(C5,ROW(INDIRECT(\"1:\"&LEN(C5))),1)*1)","v":7},{"$f":"IF(D5>22,SUMPRODUCT(VALUE(MID(D5,ROW(INDIRECT(\"$b1:$A\"&LEN(D5))),1))),D5)","v":7},{"$f":"+VLOOKUP(E5,A162:D183,2,FALSE)","v":"Wagen"},{"$f":"+VLOOKUP(E5,A162:D183,3,FALSE)","v":"7 Wagen"},{"$f":"+VLOOKUP(E5,A162:D183,4,FALSE)","v":"1 Osiris"}]
[]
[]
["Monat","Jahr","Monatszahl","Resultat","Monatskarte",null,"Konstellation","Gruppe"]
["Januar",{"$f":"$A$23","v":2023},{"$f":"B9+1","v":2024},{"$f":"SUMPRODUCT(MID(C9,ROW(INDIRECT(\"1:\"&LEN(C9))),1)*1)","v":8},{"$f":"IF(D9>22,SUMPRODUCT(VALUE(MID(D9,ROW(INDIRECT(\"$b1:$A\"&LEN(D9))),1))),D9)","v":8},{"$f":"+VLOOKUP(E9,$A$162:$D$183,2,FALSE)","v":"Kraft"},{"$f":"+VLOOKUP(E9,$A$162:$D$183,3,FALSE)","v":"8 Kraft"},{"$f":"+VLOOKUP(E9,$A$162:$D$183,4,FALSE)","v":"2 Isis"}]
["Februar",{"$f":"$A$23","v":2023},{"$f":"B10+2","v":2025},{"$f":"SUMPRODUCT(MID(C10,ROW(INDIRECT(\"1:\"&LEN(C10))),1)*1)","v":9},{"$f":"IF(D10>22,SUMPRODUCT(VALUE(MID(D10,ROW(INDIRECT(\"$b1:$A\"&LEN(D10))),1))),D10)","v":9},{"$f":"+VLOOKUP(E10,$A$162:$D$183,2,FALSE)","v":"Eremit"},{"$f":"+VLOOKUP(E10,$A$162:$D$183,3,FALSE)","v":"9 Eremit"},{"$f":"+VLOOKUP(E10,$A$162:$D$183,4,FALSE)","v":"3 Horus"}]
["März",2023,{"$f":"B11+3","v":2026},10,10,"Rad","1 Magier","1 Osiris"]
["April",2023,{"$f":"B12+4","v":2027},11,11,"Gerechtigkeit","2 Hohepriesterin","2 Isis"]
["Mai",2023,{"$f":"B13+5","v":2028},12,12,"Gehängter","3 Herrscherin","3 Horus"]
["Juni",2023,{"$f":"B14+6","v":2029},13,13,"Tod","4 Herrscher","1 Osiris"]
["Juli",2023,{"$f":"B15+7","v":2030},5,5,"Hierophant","5 Hierophant","2 Isis"]
["August",2023,{"$f":"B16+8","v":2031},6,6,"Liebende","6 Liebende","3 Horus"]
["September",2023,{"$f":"B17+9","v":2032},7,7,"Wagen","7 Wagen","1 Osiris"]
["Oktober",2023,{"$f":"B18+10","v":2033},8,8,"Kraft","8 Kraft","2 Isis"]
["November",2023,{"$f":"B19+11","v":2034},9,9,"Eremit","9 Eremit","3 Horus"]
["Dezember",2023,{"$f":"B20+12","v":2035},10,10,"Rad","1 Magier","1 Osiris"]
[]
["Jahr JJJJ"]
[2023]
["Januar","Monatszahl","Summe","Resultat","Tageskarte",null,"Konstellation","Gruppe",null,"Februar","Monatszahl","Summe","Resultat","Tageskarte",null,"Konstellation","Gruppe",null,"März","Monatszahl","Summe","Resultat","Tageskarte",null,"Konstellation","Gruppe"]
[1,{"$f":"$A$23+1","v":2024},{"$f":"SUM(A25:B25)","v":2025},{"$f":"SUMPRODUCT(MID(C25,ROW(INDIRECT(\"1:\"&LEN(C25))),1)*1)","v":9},{"$f":"IF(D25>22,SUMPRODUCT(VALUE(MID(D25,ROW(INDIRECT(\"$b1:$A\"&LEN(D25))),1))),D25)","v":9},{"$f":"+VLOOKUP(E25,$A$162:$D$183,2,FALSE)","v":"Eremit"},{"$f":"+VLOOKUP(E25,$A$162:$D$183,3,FALSE)","v":"9 Eremit"},{"$f":"+VLOOKUP(E25,$A$162:$D$183,4,FALSE)","v":"3 Horus"},null,1,{"$f":"$A$23+2","v":2025},{"$f":"SUM(J25:K25)","v":2026},{"$f":"SUMPRODUCT(MID(L25,ROW(INDIRECT(\"1:\"&LEN(L25))),1)*1)","v":10},{"$f":"IF(M25>22,SUMPRODUCT(VALUE(MID(M25,ROW(INDIRECT(\"$b1:$A\"&LEN(M25))),1))),M25)","v":10},{"$f":"+VLOOKUP(N25,$A$162:$D$183,2,FALSE)","v":"Rad"},{"$f":"+VLOOKUP(N25,$A$162:$D$183,3,FALSE)","v":"1 Magier"},{"$f":"+VLOOKUP(N25,$A$162:$D$183,4,FALSE)","v":"1 Osiris"},null,1,{"$f":"$A$23+3","v":2026},{"$f":"SUM(S25:T25)","v":2027},{"$f":"SUMPRODUCT(MID(U25,ROW(INDIRECT(\"1:\"&LEN(U25))),1)*1)","v":11},{"$f":"IF(V25>22,SUMPRODUCT(VALUE(MID(V25,ROW(INDIRECT(\"$b1:$A\"&LEN(V25))),1))),V25)","v":11},{"$f":"+VLOOKUP(W25,$A$162:$D$183,2,FALSE)","v":"Gerechtigkeit"},{"$f":"+VLOOKUP(W25,$A$162:$D$183,3,FALSE)","v":"2 Hohepriesterin"},{"$f":"+VLOOKUP(W25,$A$162:$D$183,4,FALSE)","v":"2 Isis"}]
[2,{"$f":"$A$23+1","v":2024},{"$f":"SUM(A26:B26)","v":2026},{"$f":"SUMPRODUCT(MID(C26,ROW(INDIRECT(\"1:\"&LEN(C26))),1)*1)","v":10},{"$f":"IF(D26>22,SUMPRODUCT(VALUE(MID(D26,ROW(INDIRECT(\"$b1:$A\"&LEN(D26))),1))),D26)","v":10},"Rad","1 Magier","1 Osiris",null,2,{"$f":"$A$23+2","v":2025},{"$f":"SUM(J26:K26)","v":2027},{"$f":"SUMPRODUCT(MID(L26,ROW(INDIRECT(\"1:\"&LEN(L26))),1)*1)","v":11},{"$f":"IF(M26>22,SUMPRODUCT(VALUE(MID(M26,ROW(INDIRECT(\"$b1:$A\"&LEN(M26))),1))),M26)","v":11},"Gerechtigkeit","2 Hohepriesterin","2 Isis",null,2,{"$f":"$A$23+3","v":2026},{"$f":"SUM(S26:T26)","v":2028},{"$f":"SUMPRODUCT(MID(U26,ROW(INDIRECT(\"1:\"&LEN(U26))),1)*1)","v":12},{"$f":"IF(V26>22,SUMPRODUCT(VALUE(MID(V26,ROW(INDIRECT(\"$b1:$A\"&LEN(V26))),1))),V26)","v":12},"Gehängter","3 Herrscherin","3 Horus"]
[3,2024,2027,11,11,"Gerechtigkeit","2 Hohepriesterin","2 Isis",null,3,2025,2028,12,12,"Gehängter","3 Herrscherin","3 Horus",null,3,2026,2029,13,13,"Tod","4 Herrscher","1 Osiris"]
[4,2024,2028,12,12,"Gehängter","3 Herrscherin","3 Horus",null,4,2025,2029,13,13,"Tod","4 Herrscher","1 Osiris",null,4,2026,2030,5,5,"Hierophant","5 Hierophant","2 Isis"]
[5,2024,2029,13,13,"Tod","4 Herrscher","1 Osiris",null,5,2025,2030,5,5,"Hierophant","5 Hierophant","2 Isis",null,5,2026,2031,6,6,"Liebende","6 Liebende","3 Horus"]
[6,2024,2030,5,5,"Hierophant","5 Hierophant","2 Isis",null,6,2025,2031,6,6,"Liebende","6 Liebende","3 Horus",null,6,2026,2032,7,7,"Wagen","7 Wagen","1 Osiris"]
[7,2024,2031,6,6,"Liebende","6 Liebende","3 Horus",null,7,2025,2032,7,7,"Wagen","7 Wagen","1 Osiris",null,7,2026,2033,8,8,"Kraft","8 Kraft","2 Isis"]
[8,2024,2032,7,7,"Wagen","7 Wagen","1 Osiris",null,8,2025,2033,8,8,"Kraft","8 Kraft","2 Isis",null,8,2026,2034,9,9,"Eremit","9 Eremit","3 Horus"]
[9,2024,2033,8,8,"Kraft","8 Kraft","2 Isis",null,9,2025,2034,9,9,"Eremit","9 Eremit","3 Horus",null,9,2026,2035,10,10,"Rad","1 Magier","1 Osiris"]
[10,2024,2034,9,9,"Eremit","9 Eremit","3 Horus",null,10,2025,2035,10,10,"Rad","1 Magier","1 Osiris",null,10,2026,2036,11,11,"Gerechtigkeit","2 Hohepriesterin","2 Isis"]
[11,2024,2035,10,10,"Rad","1 Magier","1 Osiris",null,11,2025,2036,11,11,"Gerechtigkeit","2 Hohepriesterin","2 Isis",null,11,2026,2037,12,12,"Gehängter","3 Herrscherin","3 Horus"]
[12,2024,2036,11,11,"Gerechtigkeit","2 Hohepriesterin","2 Isis",null,12,2025,2037,12,12,"Gehängter","3 Herrscherin","3 Horus",null,12,2026,2038,13,13,"Tod","4 Herrscher","1 Osiris"]
[13,2024,2037,12,12,"Gehängter","3 Herrscherin","3 Horus",null,13,2025,2038,13,13,"Tod","4 Herrscher","1 Osiris",null,13,2026,2039,14,14,"Mässigkeit","5 Hierophant","2 Isis"]
[14,2024,2038,13,13,"Tod","4 Herrscher","1 Osiris",null,14,2025,2039,14,14,"Mässigkeit","5 Hierophant","2 Isis",null,14,2026,2040,6,6,"Liebende","6 Liebende","3 Horus"]
[15,2024,2039,14,14,"Mässigkeit","5 Hierophant","2 Isis",null,15,2025,2040,6,6,"Liebende","6 Liebende","3 Horus",null,15,2026,2041,7,7,"Wagen","7 Wagen","1 Osiris"]
[16,2024,2040,6,6,"Liebende","6 Liebende","3 Horus",null,16,2025,2041,7,7,"Wagen","7 Wagen","1 Osiris",null,16,2026,2042,8,8,"Kraft","8 Kraft","2 Isis"]
[17,2024,2041,7,7,"Wagen","7 Wagen","1 Osiris",null,17,2025,2042,8,8,"Kraft","8 Kraft","2 Isis",null,17,2026,2043,9,9,"Eremit","9 Eremit","3 Horus"]
[18,2024,2042,8,8,"Kraft","8 Kraft","2 Isis",null,18,2025,2043,9,9,"Eremit","9 Eremit","3 Horus",null,18,2026,2044,10,10,"Rad","1 Magier","1 Osiris"]
[19,2024,2043,9,9,"Eremit","9 Eremit","3 Horus",null,19,2025,2044,10,10,"Rad","1 Magier","1 Osiris",null,19,2026,2045,11,11,"Gerechtigkeit","2 Hohepriesterin","2 Isis"]
[20,2024,2044,10,10,"Rad","1 Magier","1 Osiris",null,20,2025,2045,11,11,"Gerechtigkeit","2 Hohepriesterin","2 Isis",null,20,2026,2046,12,12,"Gehängter","3 Herrscherin","3 Horus"]
[21,2024,2045,11,11,"Gerechtigkeit","2 Hohepriesterin","2 Isis",null,21,2025,2046,12,12,"Gehängter","3 Herrscherin","3 Horus",null,21,2026,2047,13,13,"Tod","4 Herrscher","1 Osiris"]
[22,2024,2046,12,12,"Gehängter","3 Herrscherin","3 Horus",null,22,2025,2047,13,13,"Tod","4 Herrscher","1 Osiris",null,22,2026,2048,14,14,"Mässigkeit","5 Hierophant","2 Isis"]
[23,2024,2047,13,13,"Tod","4 Herrscher","1 Osiris",null,23,2025,2048,14,14,"Mässigkeit","5 Hierophant","2 Isis",null,23,2026,2049,15,15,"Teufel","6 Liebende","3 Horus"]
[24,2024,2048,14,14,"Mässigkeit","5 Hierophant","2 Isis",null,24,2025,2049,15,15,"Teufel","6 Liebende","3 Horus",null,24,2026,2050,7,7,"Wagen","7 Wagen","1 Osiris"]
[25,2024,2049,15,15,"Teufel","6 Liebende","3 Horus",null,25,2025,2050,7,7,"Wagen","7 Wagen","1 Osiris",null,25,2026,2051,8,8,"Kraft","8 Kraft","2 Isis"]
[26,2024,2050,7,7,"Wagen","7 Wagen","1 Osiris",null,26,2025,2051,8,8,"Kraft","8 Kraft","2 Isis",null,26,2026,2052,9,9,"Eremit","9 Eremit","3 Horus"]
[27,2024,2051,8,8,"Kraft","8 Kraft","2 Isis",null,27,2025,2052,9,9,"Eremit","9 Eremit","3 Horus",null,27,2026,2053,10,10,"Rad","1 Magier","1 Osiris"]
[28,2024,2052,9,9,"Eremit","9 Eremit","3 Horus",null,28,2025,2053,10,10,"Rad","1 Magier","1 Osiris",null,28,2026,2054,11,11,"Gerechtigkeit","2 Hohepriesterin","2 Isis"]
[29,2024,2053,10,10,"Rad","1 Magier","1 Osiris",null,29,2025,2054,11,11,"Gerechtigkeit","2 Hohepriesterin","2 Isis",null,29,2026,2055,12,12,"Gehängter","3 Herrscherin","3 Horus"]
[30,2024,2054,11,11,"Gerechtigkeit","2 Hohepriesterin","2 Isis",null,null,null,null,null,null,null,null,null,null,30,2026,2056,13,13,"Tod","4 Herrscher","1 Osiris"]
[31,2024,2055,12,12,"Gehängter","3 Herrscherin","3 Horus",null,null,null,null,null,null,null,null,null,null,31,2026,2057,14,14,"Mässigkeit","5 Hierophant","2 Isis"]
[]
[]
["April","Monatszahl","Summe","Resultat","Tageskarte",null,"Konstellation","Gruppe",null,"Mai","Monatszahl","Summe","Resultat","Tageskarte",null,"Konstellation","Gruppe",null,"Juni","Monatszahl","Summe","Resultat","Tageskarte",null,"Konstellation","Gruppe"]
[1,{"$f":"$A$23+4","v":2027},{"$f":"SUM(A59:B59)","v":2028},{"$f":"SUMPRODUCT(MID(C59,ROW(INDIRECT(\"1:\"&LEN(C59))),1)*1)","v":12},{"$f":"IF(D59>22,SUMPRODUCT(VALUE(MID(D59,ROW(INDIRECT(\"$b1:$A\"&LEN(D59))),1))),D59)","v":12},{"$f":"+VLOOKUP(E59,$A$162:$D$183,2,FALSE)","v":"Gehängter"},{"$f":"+VLOOKUP(E59,$A$162:$D$183,3,FALSE)","v":"3 Herrscherin"},{"$f":"+VLOOKUP(E59,$A$162:$D$183,4,FALSE)","v":"3 Horus"},null,1,{"$f":"$A$23+5","v":2028},{"$f":"SUM(J59:K59)","v":2029},{"$f":"SUMPRODUCT(MID(L59,ROW(INDIRECT(\"1:\"&LEN(L59))),1)*1)","v":13},{"$f":"IF(M59>22,SUMPRODUCT(VALUE(MID(M59,ROW(INDIRECT(\"$b1:$A\"&LEN(M59))),1))),M59)","v":13},{"$f":"+VLOOKUP(N59,$A$162:$D$183,2,FALSE)","v":"Tod"},{"$f":"+VLOOKUP(N59,$A$162:$D$183,3,FALSE)","v":"4 Herrscher"},{"$f":"+VLOOKUP(N59,$A$162:$D$183,4,FALSE)","v":"1 Osiris"},null,1,{"$f":"$A$23+6","v":2029},{"$f":"SUM(S59:T59)","v":2030},{"$f":"SUMPRODUCT(MID(U59,ROW(INDIRECT(\"1:\"&LEN(U59))),1)*1)","v":5},{"$f":"IF(V59>22,SUMPRODUCT(VALUE(MID(V59,ROW(INDIRECT(\"$b1:$A\"&LEN(V59))),1))),V59)","v":5},{"$f":"+VLOOKUP(W59,$A$162:$D$183,2,FALSE)","v":"Hierophant"},{"$f":"+VLOOKUP(W59,$A$162:$D$183,3,FALSE)","v":"5 Hierophant"},{"$f":"+VLOOKUP(W59,$A$162:$D$183,4,FALSE)","v":"2 Isis"}]
[2,{"$f":"$A$23+4","v":2027},{"$f":"SUM(A60:B60)","v":2029},13,13,"Tod","4 Herrscher","1 Osiris",null,2,{"$f":"$A$23+5","v":2028},{"$f":"SUM(J60:K60)","v":2030},{"$f":"SUMPRODUCT(MID(L60,ROW(INDIRECT(\"1:\"&LEN(L60))),1)*1)","v":5},5,"Hierophant","5 Hierophant","2 Isis",null,2,{"$f":"$A$23+6","v":2029},{"$f":"SUM(S60:T60)","v":2031},6,6,"Liebende","6 Liebende","3 Horus"]
[3,2027,2030,5,5,"Hierophant","5 Hierophant","2 Isis",null,3,2028,2031,6,6,"Liebende","6 Liebende","3 Horus",null,3,2029,2032,7,7,"Wagen","7 Wagen","1 Osiris"]
[4,2027,2031,6,6,"Liebende","6 Liebende","3 Horus",null,4,2028,2032,7,7,"Wagen","7 Wagen","1 Osiris",null,4,2029,2033,8,8,"Kraft","8 Kraft","2 Isis"]
[5,2027,2032,7,7,"Wagen","7 Wagen","1 Osiris",null,5,2028,2033,8,8,"Kraft","8 Kraft","2 Isis",null,5,2029,2034,9,9,"Eremit","9 Eremit","3 Horus"]
[6,2027,2033,8,8,"Kraft","8 Kraft","2 Isis",null,6,2028,2034,9,9,"Eremit","9 Eremit","3 Horus",null,6,2029,2035,10,10,"Rad","1 Magier","1 Osiris"]
[7,2027,2034,9,9,"Eremit","9 Eremit","3 Horus",null,7,2028,2035,10,10,"Rad","1 Magier","1 Osiris",null,7,2029,2036,11,11,"Gerechtigkeit","2 Hohepriesterin","2 Isis"]
[8,2027,2035,10,10,"Rad","1 Magier","1 Osiris",null,8,2028,2036,11,11,"Gerechtigkeit","2 Hohepriesterin","2 Isis",null,8,2029,2037,12,12,"Gehängter","3 Herrscherin","3 Horus"]
[9,2027,2036,11,11,"Gerechtigkeit","2 Hohepriesterin","2 Isis",null,9,2028,2037,12,12,"Gehängter","3 Herrscherin","3 Horus",null,9,2029,2038,13,13,"Tod","4 Herrscher","1 Osiris"]
[10,2027,2037,12,12,"Gehängter","3 Herrscherin","3 Horus",null,10,2028,2038,13,13,"Tod","4 Herrscher","1 Osiris",null,10,2029,2039,14,14,"Mässigkeit","5 Hierophant","2 Isis"]
[11,2027,2038,13,13,"Tod","4 Herrscher","1 Osiris",null,11,2028,2039,14,14,"Mässigkeit","5 Hierophant","2 Isis",null,11,2029,2040,6,6,"Liebende","6 Liebende","3 Horus"]
[12,2027,2039,14,14,"Mässigkeit","5 Hierophant","2 Isis",null,12,2028,2040,6,6,"Liebende","6 Liebende","3 Horus",null,12,2029,2041,7,7,"Wagen","7 Wagen","1 Osiris"]
[13,2027,2040,6,6,"Liebende","6 Liebende","3 Horus",null,13,2028,2041,7,7,"Wagen","7 Wagen","1 Osiris",null,13,2029,2042,8,8,"Kraft","8 Kraft","2 Isis"]
[14,2027,2041,7,7,"Wagen","7 Wagen","1 Osiris",null,14,2028,2042,8,8,"Kraft","8 Kraft","2 Isis",null,14,2029,2043,9,9,"Eremit","9 Eremit","3 Horus"]
[15,2027,2042,8,8,"Kraft","8 Kraft","2 Isis",null,15,2028,2043,9,9,"Eremit","9 Eremit","3 Horus",null,15,2029,2044,10,10,"Rad","1 Magier","1 Osiris"]
[16,2027,2043,9,9,"Eremit","9 Eremit","3 Horus",null,16,2028,2044,10,10,"Rad","1 Magier","1 Osiris",null,16,2029,2045,11,11,"Gerechtigkeit","2 Hohepriesterin","2 Isis"]
[17,2027,2044,10,10,"Rad","1 Magier","1 Osiris",null,17,2028,2045,11,11,"Gerechtigkeit","2 Hohepriesterin","2 Isis",null,17,2029,2046,12,12,"Gehängter","3 Herrscherin","3 Horus"]
[18,2027,2045,11,11,"Gerechtigkeit","2 Hohepriesterin","2 Isis",null,18,2028,2046,12,12,"Gehängter","3 Herrscherin","3 Horus",null,18,2029,2047,13,13,"Tod","4 Herrscher","1 Osiris"]
[19,2027,2046,12,12,"Gehängter","3 Herrscherin","3 Horus",null,19,2028,2047,13,13,"Tod","4 Herrscher","1 Osiris",null,19,2029,2048,14,14,"Mässigkeit","5 Hierophant","2 Isis"]
[20,2027,2047,13,13,"Tod","4 Herrscher","1 Osiris",null,20,2028,2048,14,14,"Mässigkeit","5 Hierophant","2 Isis",null,20,2029,2049,15,15,"Teufel","6 Liebende","3 Horus"]
[21,2027,2048,14,14,"Mässigkeit","5 Hierophant","2 Isis",null,21,2028,2049,15,15,"Teufel","6 Liebende","3 Horus",null,21,2029,2050,7,7,"Wagen","7 Wagen","1 Osiris"]
[22,2027,2049,15,15,"Teufel","6 Liebende","3 Horus",null,22,2028,2050,7,7,"Wagen","7 Wagen","1 Osiris",null,22,2029,2051,8,8,"Kraft","8 Kraft","2 Isis"]
[23,2027,2050,7,7,"Wagen","7 Wagen","1 Osiris",null,23,2028,2051,8,8,"Kraft","8 Kraft","2 Isis",null,23,2029,2052,9,9,"Eremit","9 Eremit","3 Horus"]
[24,2027,2051,8,8,"Kraft","8 Kraft","2 Isis",null,24,2028,2052,9,9,"Eremit","9 Eremit","3 Horus",null,24,2029,2053,10,10,"Rad","1 Magier","1 Osiris"]
[25,2027,2052,9,9,"Eremit","9 Eremit","3 Horus",null,25,2028,2053,10,10,"Rad","1 Magier","1 Osiris",null,25,2029,2054,11,11,"Gerechtigkeit","2 Hohepriesterin","2 Isis"]
[26,2027,2053,10,10,"Rad","1 Magier","1 Osiris",null,26,2028,2054,11,11,"Gerechtigkeit","2 Hohepriesterin","2 Isis",null,26,2029,2055,12,12,"Gehängter","3 Herrscherin","3 Horus"]
[27,2027,2054,11,11,"Gerechtigkeit","2 Hohepriesterin","2 Isis",null,27,2028,2055,12,12,"Gehängter","3 Herrscherin","3 Horus",null,27,2029,2056,13,13,"Tod","4 Herrscher","1 Osiris"]
[28,2027,2055,12,12,"Gehängter","3 Herrscherin","3 Horus",null,28,2028,2056,13,13,"Tod","4 Herrscher","1 Osiris",null,28,2029,2057,14,14,"Mässigkeit","5 Hierophant","2 Isis"]
[29,2027,2056,13,13,"Tod","4 Herrscher","1 Osiris",null,29,2028,2057,14,14,"Mässigkeit","5 Hierophant","2 Isis",null,29,2029,2058,15,15,"Teufel","6 Liebende","3 Horus"]
[30,2027,2057,14,14,"Mässigkeit","5 Hierophant","2 Isis",null,30,2028,2058,15,15,"Teufel","6 Liebende","3 Horus",null,30,2029,2059,16,16,"Turm","7 Wagen","1 Osiris"]
[null,null,null,null,null,null,null,null,null,31,2028,2059,16,16,"Turm","7 Wagen","1 Osiris"]
[]
[]
["Juli","Monatszahl","Summe","Resultat","Tageskarte",null,"Konstellation","Gruppe",null,"August","Monatszahl","Summe","Resultat","Tageskarte",null,"Konstellation","Gruppe",null,"September","Monatszahl","Summe","Resultat","Tageskarte",null,"Konstellation","Gruppe"]
[1,{"$f":"$A$23+7","v":2030},{"$f":"SUM(A93:B93)","v":2031},{"$f":"SUMPRODUCT(MID(C93,ROW(INDIRECT(\"1:\"&LEN(C93))),1)*1)","v":6},{"$f":"IF(D93>22,SUMPRODUCT(VALUE(MID(D93,ROW(INDIRECT(\"$b1:$A\"&LEN(D93))),1))),D93)","v":6},{"$f":"+VLOOKUP(E93,$A$162:$D$183,2,FALSE)","v":"Liebende"},{"$f":"+VLOOKUP(E93,$A$162:$D$183,3,FALSE)","v":"6 Liebende"},{"$f":"+VLOOKUP(E93,$A$162:$D$183,4,FALSE)","v":"3 Horus"},null,1,{"$f":"$A$23+8","v":2031},{"$f":"SUM(J93:K93)","v":2032},{"$f":"SUMPRODUCT(MID(L93,ROW(INDIRECT(\"1:\"&LEN(L93))),1)*1)","v":7},{"$f":"IF(M93>22,SUMPRODUCT(VALUE(MID(M93,ROW(INDIRECT(\"$b1:$A\"&LEN(M93))),1))),M93)","v":7},{"$f":"+VLOOKUP(N93,$A$162:$D$183,2,FALSE)","v":"Wagen"},{"$f":"+VLOOKUP(N93,$A$162:$D$183,3,FALSE)","v":"7 Wagen"},{"$f":"+VLOOKUP(N93,$A$162:$D$183,4,FALSE)","v":"1 Osiris"},null,1,{"$f":"$A$23+9","v":2032},{"$f":"SUM(S93:T93)","v":2033},{"$f":"SUMPRODUCT(MID(U93,ROW(INDIRECT(\"1:\"&LEN(U93))),1)*1)","v":8},{"$f":"IF(V93>22,SUMPRODUCT(VALUE(MID(V93,ROW(INDIRECT(\"$b1:$A\"&LEN(V93))),1))),V93)","v":8},{"$f":"+VLOOKUP(W93,$A$162:$D$183,2,FALSE)","v":"Kraft"},{"$f":"+VLOOKUP(W93,$A$162:$D$183,3,FALSE)","v":"8 Kraft"},{"$f":"+VLOOKUP(W93,$A$162:$D$183,4,FALSE)","v":"2 Isis"}]
[2,{"$f":"$A$23+7","v":2030},{"$f":"SUM(A94:B94)","v":2032},{"$f":"SUMPRODUCT(MID(C94,ROW(INDIRECT(\"1:\"&LEN(C94))),1)*1)","v":7},7,"Wagen","7 Wagen","1 Osiris",null,2,{"$f":"$A$23+8","v":2031},{"$f":"SUM(J94:K94)","v":2033},8,8,"Kraft","8 Kraft","2 Isis",null,2,{"$f":"$A$23+9","v":2032},{"$f":"SUM(S94:T94)","v":2034},9,9,"Eremit","9 Eremit","3 Horus"]
[3,2030,2033,8,8,"Kraft","8 Kraft","2 Isis",null,3,2031,2034,9,9,"Eremit","9 Eremit","3 Horus",null,3,2032,2035,10,10,"Rad","1 Magier","1 Osiris"]
[4,2030,2034,9,9,"Eremit","9 Eremit","3 Horus",null,4,2031,2035,10,10,"Rad","1 Magier","1 Osiris",null,4,2032,2036,11,11,"Gerechtigkeit","2 Hohepriesterin","2 Isis"]
[5,2030,2035,10,10,"Rad","1 Magier","1 Osiris",null,5,2031,2036,11,11,"Gerechtigkeit","2 Hohepriesterin","2 Isis",null,5,2032,2037,12,12,"Gehängter","3 Herrscherin","3 Horus"]
[6,2030,2036,11,11,"Gerechtigkeit","2 Hohepriesterin","2 Isis",null,6,2031,2037,12,12,"Gehängter","3 Herrscherin","3 Horus",null,6,2032,2038,13,13,"Tod","4 Herrscher","1 Osiris"]
[7,2030,2037,12,12,"Gehängter","3 Herrscherin","3 Horus",null,7,2031,2038,13,13,"Tod","4 Herrscher","1 Osiris",null,7,2032,2039,14,14,"Mässigkeit","5 Hierophant","2 Isis"]
[8,2030,2038,13,13,"Tod","4 Herrscher","1 Osiris",null,8,2031,2039,14,14,"Mässigkeit","5 Hierophant","2 Isis",null,8,2032,2040,6,6,"Liebende","6 Liebende","3 Horus"]
[9,2030,2039,14,14,"Mässigkeit","5 Hierophant","2 Isis",null,9,2031,2040,6,6,"Liebende","6 Liebende","3 Horus",null,9,2032,2041,7,7,"Wagen","7 Wagen","1 Osiris"]
[10,2030,2040,6,6,"Liebende","6 Liebende","3 Horus",null,10,2031,2041,7,7,"Wagen","7 Wagen","1 Osiris",null,10,2032,2042,8,8,"Kraft","8 Kraft","2 Isis"]
[11,2030,2041,7,7,"Wagen","7 Wagen","1 Osiris",null,11,2031,2042,8,8,"Kraft","8 Kraft","2 Isis",null,11,2032,2043,9,9,"Eremit","9 Eremit","3 Horus"]
[12,2030,2042,8,8,"Kraft","8 Kraft","2 Isis",null,12,2031,2043,9,9,"Eremit","9 Eremit","3 Horus",null,12,2032,2044,10,10,"Rad","1 Magier","1 Osiris"]
[13,2030,2043,9,9,"Eremit","9 Eremit","3 Horus",null,13,2031,2044,10,10,"Rad","1 Magier","1 Osiris",null,13,2032,2045,11,11,"Gerechtigkeit","2 Hohepriesterin","2 Isis"]
[14,2030,2044,10,10,"Rad","1 Magier","1 Osiris",null,14,2031,2045,11,11,"Gerechtigkeit","2 Hohepriesterin","2 Isis",null,14,2032,2046,12,12,"Gehängter","3 Herrscherin","3 Horus"]
[15,2030,2045,11,11,"Gerechtigkeit","2 Hohepriesterin","2 Isis",null,15,2031,2046,12,12,"Gehängter","3 Herrscherin","3 Horus",null,15,2032,2047,13,13,"Tod","4 Herrscher","1 Osiris"]
[16,2030,2046,12,12,"Gehängter","3 Herrscherin","3 Horus",null,16,2031,2047,13,13,"Tod","4 Herrscher","1 Osiris",null,16,2032,2048,14,14,"Mässigkeit","5 Hierophant","2 Isis"]
[17,2030,2047,13,13,"Tod","4 Herrscher","1 Osiris",null,17,2031,2048,14,14,"Mässigkeit","5 Hierophant","2 Isis",null,17,2032,2049,15,15,"Teufel","6 Liebende","3 Horus"]
[18,2030,2048,14,14,"Mässigkeit","5 Hierophant","2 Isis",null,18,2031,2049,15,15,"Teufel","6 Liebende","3 Horus",null,18,2032,2050,7,7,"Wagen","7 Wagen","1 Osiris"]
[19,2030,2049,15,15,"Teufel","6 Liebende","3 Horus",null,19,2031,2050,7,7,"Wagen","7 Wagen","1 Osiris",null,19,2032,2051,8,8,"Kraft","8 Kraft","2 Isis"]
[20,2030,2050,7,7,"Wagen","7 Wagen","1 Osiris",null,20,2031,2051,8,8,"Kraft","8 Kraft","2 Isis",null,20,2032,2052,9,9,"Eremit","9 Eremit","3 Horus"]
[21,2030,2051,8,8,"Kraft","8 Kraft","2 Isis",null,21,2031,2052,9,9,"Eremit","9 Eremit","3 Horus",null,21,2032,2053,10,10,"Rad","1 Magier","1 Osiris"]
[22,2030,2052,9,9,"Eremit","9 Eremit","3 Horus",null,22,2031,2053,10,10,"Rad","1 Magier","1 Osiris",null,22,2032,2054,11,11,"Gerechtigkeit","2 Hohepriesterin","2 Isis"]
[23,2030,2053,10,10,"Rad","1 Magier","1 Osiris",null,23,2031,2054,11,11,"Gerechtigkeit","2 Hohepriesterin","2 Isis",null,23,2032,2055,12,12,"Gehängter","3 Herrscherin","3 Horus"]
[24,2030,2054,11,11,"Gerechtigkeit","2 Hohepriesterin","2 Isis",null,24,2031,2055,12,12,"Gehängter","3 Herrscherin","3 Horus",null,24,2032,2056,13,13,"Tod","4 Herrscher","1 Osiris"]
[25,2030,2055,12,12,"Gehängter","3 Herrscherin","3 Horus",null,25,2031,2056,13,13,"Tod","4 Herrscher","1 Osiris",null,25,2032,2057,14,14,"Mässigkeit","5 Hierophant","2 Isis"]
[26,2030,2056,13,13,"Tod","4 Herrscher","1 Osiris",null,26,2031,2057,14,14,"Mässigkeit","5 Hierophant","2 Isis",null,26,2032,2058,15,15,"Teufel","6 Liebende","3 Horus"]
[27,2030,2057,14,14,"Mässigkeit","5 Hierophant","2 Isis",null,27,2031,2058,15,15,"Teufel","6 Liebende","3 Horus",null,27,2032,2059,16,16,"Turm","7 Wagen","1 Osiris"]
[28,2030,2058,15,15,"Teufel","6 Liebende","3 Horus",null,28,2031,2059,16,16,"Turm","7 Wagen","1 Osiris",null,28,2032,2060,8,8,"Kraft","8 Kraft","2 Isis"]
[29,2030,2059,16,16,"Turm","7 Wagen","1 Osiris",null,29,2031,2060,8,8,"Kraft","8 Kraft","2 Isis",null,29,2032,2061,9,9,"Eremit","9 Eremit","3 Horus"]
[30,2030,2060,8,8,"Kraft","8 Kraft","2 Isis",null,30,2031,2061,9,9,"Eremit","9 Eremit","3 Horus",null,30,2032,2062,10,10,"Rad","1 Magier","1 Osiris"]
[31,2030,2061,9,9,"Eremit","9 Eremit","3 Horus",null,31,2031,2062,10,10,"Rad","1 Magier","1 Osiris"]
[]
[]
["Oktober","Monatszahl","Summe","Resultat","Tageskarte",null,"Konstellation","Gruppe",null,"November","Monatszahl","Summe","Resultat","Tageskarte",null,null,null,null,"Dezember","Monatszahl","Summe","Resultat","Tageskarte",null,"Konstellation","Gruppe"]
[1,{"$f":"$A$23+10","v":2033},{"$f":"SUM(A127:B127)","v":2034},{"$f":"SUMPRODUCT(MID(C127,ROW(INDIRECT(\"1:\"&LEN(C127))),1)*1)","v":9},{"$f":"IF(D127>22,SUMPRODUCT(VALUE(MID(D127,ROW(INDIRECT(\"$b1:$A\"&LEN(D127))),1))),D127)","v":9},{"$f":"+VLOOKUP(E127,$A$162:$D$183,2,FALSE)","v":"Eremit"},{"$f":"+VLOOKUP(E127,$A$162:$D$183,3,FALSE)","v":"9 Eremit"},{"$f":"+VLOOKUP(E127,$A$162:$D$183,4,FALSE)","v":"3 Horus"},null,1,{"$f":"$A$23+11","v":2034},{"$f":"SUM(J127:K127)","v":2035},{"$f":"SUMPRODUCT(MID(L127,ROW(INDIRECT(\"1:\"&LEN(L127))),1)*1)","v":10},{"$f":"IF(M127>22,SUMPRODUCT(VALUE(MID(M127,ROW(INDIRECT(\"$b1:$A\"&LEN(M127))),1))),M127)","v":10},{"$f":"+VLOOKUP(N127,$A$162:$D$183,2,FALSE)","v":"Rad"},{"$f":"+VLOOKUP(N127,$A$162:$D$183,3,FALSE)","v":"1 Magier"},{"$f":"+VLOOKUP(N127,$A$162:$D$183,4,FALSE)","v":"1 Osiris"},null,1,{"$f":"$A$23+12","v":2035},{"$f":"SUM(S127:T127)","v":2036},{"$f":"SUMPRODUCT(MID(U127,ROW(INDIRECT(\"1:\"&LEN(U127))),1)*1)","v":11},{"$f":"IF(V127>22,SUMPRODUCT(VALUE(MID(V127,ROW(INDIRECT(\"$b1:$A\"&LEN(V127))),1))),V127)","v":11},{"$f":"+VLOOKUP(W127,$A$162:$D$183,2,FALSE)","v":"Gerechtigkeit"},{"$f":"+VLOOKUP(W127,$A$162:$D$183,3,FALSE)","v":"2 Hohepriesterin"},{"$f":"+VLOOKUP(W127,$A$162:$D$183,4,FALSE)","v":"2 Isis"}]
[2,{"$f":"$A$23+10","v":2033},{"$f":"SUM(A128:B128)","v":2035},10,10,"Rad","1 Magier","1 Osiris",null,2,{"$f":"$A$23+11","v":2034},{"$f":"SUM(J128:K128)","v":2036},11,11,"Gerechtigkeit","2 Hohepriesterin","2 Isis",null,2,{"$f":"$A$23+12","v":2035},{"$f":"SUM(S128:T128)","v":2037},12,12,"Gehängter","3 Herrscherin","3 Horus"]
[3,2033,2036,11,11,"Gerechtigkeit","2 Hohepriesterin","2 Isis",null,3,2034,2037,12,12,"Gehängter","3 Herrscherin","3 Horus",null,3,2035,2038,13,13,"Tod","4 Herrscher","1 Osiris"]
[4,2033,2037,12,12,"Gehängter","3 Herrscherin","3 Horus",null,4,2034,2038,13,13,"Tod","4 Herrscher","1 Osiris",null,4,2035,2039,14,14,"Mässigkeit","5 Hierophant","2 Isis"]
[5,2033,2038,13,13,"Tod","4 Herrscher","1 Osiris",null,5,2034,2039,14,14,"Mässigkeit","5 Hierophant","2 Isis",null,5,2035,2040,6,6,"Liebende","6 Liebende","3 Horus"]
[6,2033,2039,14,14,"Mässigkeit","5 Hierophant","2 Isis",null,6,2034,2040,6,6,"Liebende","6 Liebende","3 Horus",null,6,2035,2041,7,7,"Wagen","7 Wagen","1 Osiris"]
[7,2033,2040,6,6,"Liebende","6 Liebende","3 Horus",null,7,2034,2041,7,7,"Wagen","7 Wagen","1 Osiris",null,7,2035,2042,8,8,"Kraft","8 Kraft","2 Isis"]
[8,2033,2041,7,7,"Wagen","7 Wagen","1 Osiris",null,8,2034,2042,8,8,"Kraft","8 Kraft","2 Isis",null,8,2035,2043,9,9,"Eremit","9 Eremit","3 Horus"]
[9,2033,2042,8,8,"Kraft","8 Kraft","2 Isis",null,9,2034,2043,9,9,"Eremit","9 Eremit","3 Horus",null,9,2035,2044,10,10,"Rad","1 Magier","1 Osiris"]
[10,2033,2043,9,9,"Eremit","9 Eremit","3 Horus",null,10,2034,2044,10,10,"Rad","1 Magier","1 Osiris",null,10,2035,2045,11,11,"Gerechtigkeit","2 Hohepriesterin","2 Isis"]
[11,2033,2044,10,10,"Rad","1 Magier","1 Osiris",null,11,2034,2045,11,11,"Gerechtigkeit","2 Hohepriesterin","2 Isis",null,11,2035,2046,12,12,"Gehängter","3 Herrscherin","3 Horus"]
[12,2033,2045,11,11,"Gerechtigkeit","2 Hohepriesterin","2 Isis",null,12,2034,2046,12,12,"Gehängter","3 Herrscherin","3 Horus",null,12,2035,2047,13,13,"Tod","4 Herrscher","1 Osiris"]
[13,2033,2046,12,12,"Gehängter","3 Herrscherin","3 Horus",null,13,2034,2047,13,13,"Tod","4 Herrscher","1 Osiris",null,13,2035,2048,14,14,"Mässigkeit","5 Hierophant","2 Isis"]
[14,2033,2047,13,13,"Tod","4 Herrscher","1 Osiris",null,14,2034,2048,14,14,"Mässigkeit","5 Hierophant","2 Isis",null,14,2035,2049,15,15,"Teufel","6 Liebende","3 Horus"]
[15,2033,2048,14,14,"Mässigkeit","5 Hierophant","2 Isis",null,15,2034,2049,15,15,"Teufel","6 Liebende","3 Horus",null,15,2035,2050,7,7,"Wagen","7 Wagen","1 Osiris"]
[16,2033,2049,15,15,"Teufel","6 Liebende","3 Horus",null,16,2034,2050,7,7,"Wagen","7 Wagen","1 Osiris",null,16,2035,2051,8,8,"Kraft","8 Kraft","2 Isis"]
[17,2033,2050,7,7,"Wagen","7 Wagen","1 Osiris",null,17,2034,2051,8,8,"Kraft","8 Kraft","2 Isis",null,17,2035,2052,9,9,"Eremit","9 Eremit","3 Horus"]
[18,2033,2051,8,8,"Kraft","8 Kraft","2 Isis",null,18,2034,2052,9,9,"Eremit","9 Eremit","3 Horus",null,18,2035,2053,10,10,"Rad","1 Magier","1 Osiris"]
[19,2033,2052,9,9,"Eremit","9 Eremit","3 Horus",null,19,2034,2053,10,10,"Rad","1 Magier","1 Osiris",null,19,2035,2054,11,11,"Gerechtigkeit","2 Hohepriesterin","2 Isis"]
[20,2033,2053,10,10,"Rad","1 Magier","1 Osiris",null,20,2034,2054,11,11,"Gerechtigkeit","2 Hohepriesterin","2 Isis",null,20,2035,2055,12,12,"Gehängter","3 Herrscherin","3 Horus"]
[21,2033,2054,11,11,"Gerechtigkeit","2 Hohepriesterin","2 Isis",null,21,2034,2055,12,12,"Gehängter","3 Herrscherin","3 Horus",null,21,2035,2056,13,13,"Tod","4 Herrscher","1 Osiris"]
[22,2033,2055,12,12,"Gehängter","3 Herrscherin","3 Horus",null,22,2034,2056,13,13,"Tod","4 Herrscher","1 Osiris",null,22,2035,2057,14,14,"Mässigkeit","5 Hierophant","2 Isis"]
[23,2033,2056,13,13,"Tod","4 Herrscher","1 Osiris",null,23,2034,2057,14,14,"Mässigkeit","5 Hierophant","2 Isis",null,23,2035,2058,15,15,"Teufel","6 Liebende","3 Horus"]
[24,2033,2057,14,14,"Mässigkeit","5 Hierophant","2 Isis",null,24,2034,2058,15,15,"Teufel","6 Liebende","3 Horus",null,24,2035,2059,16,16,"Turm","7 Wagen","1 Osiris"]
[25,2033,2058,15,15,"Teufel","6 Liebende","3 Horus",null,25,2034,2059,16,16,"Turm","7 Wagen","1 Osiris",null,25,2035,2060,8,8,"Kraft","8 Kraft","2 Isis"]
[26,2033,2059,16,16,"Turm","7 Wagen","1 Osiris",null,26,2034,2060,8,8,"Kraft","8 Kraft","2 Isis",null,26,2035,2061,9,9,"Eremit","9 Eremit","3 Horus"]
[27,2033,2060,8,8,"Kraft","8 Kraft","2 Isis",null,27,2034,2061,9,9,"Eremit","9 Eremit","3 Horus",null,27,2035,2062,10,10,"Rad","1 Magier","1 Osiris"]
[28,2033,2061,9,9,"Eremit","9 Eremit","3 Horus",null,28,2034,2062,10,10,"Rad","1 Magier","1 Osiris",null,28,2035,2063,11,11,"Gerechtigkeit","2 Hohepriesterin","2 Isis"]
[29,2033,2062,10,10,"Rad","1 Magier","1 Osiris",null,29,2034,2063,11,11,"Gerechtigkeit","2 Hohepriesterin","2 Isis",null,29,2035,2064,12,12,"Gehängter","3 Herrscherin","3 Horus"]
[30,2033,2063,11,11,"Gerechtigkeit","2 Hohepriesterin","2 Isis",null,30,2034,2064,12,12,"Gehängter","3 Herrscherin","3 Horus",null,30,2035,2065,13,13,"Tod","4 Herrscher","1 Osiris"]
[31,2033,2064,12,12,"Gehängter","3 Herrscherin","3 Horus",null,null,null,null,null,null,null,null,null,null,31,2035,2066,14,14,"Mässigkeit","5 Hierophant","2 Isis"]
[]
[]
[]
[]
[1,"Magier","1 Magier","1 Osiris"]
[2,"Hohepriesterin","2 Hohepriesterin","2 Isis"]
[3,"Herrscherin","3 Herrscherin","3 Horus"]
[4,"Herrscher","4 Herrscher","1 Osiris"]
[5,"Hierophant","5 Hierophant","2 Isis"]
[6,"Liebende","6 Liebende","3 Horus"]
[7,"Wagen","7 Wagen","1 Osiris"]
[8,"Kraft","8 Kraft","2 Isis"]
[9,"Eremit","9 Eremit","3 Horus"]
[10,"Rad","1 Magier","1 Osiris"]
[11,"Gerechtigkeit","2 Hohepriesterin","2 Isis"]
[12,"Gehängter","3 Herrscherin","3 Horus"]
[13,"Tod","4 Herrscher","1 Osiris"]
[14,"Mässigkeit","5 Hierophant","2 Isis"]
[15,"Teufel","6 Liebende","3 Horus"]
[16,"Turm","7 Wagen","1 Osiris"]
[17,"Stern","8 Kraft","2 Isis"]
[18,"Mond","9 Eremit","3 Horus"]
[19,"Sonne","1 Magier","1 Osiris"]
[20,"Gericht","2 Hohepriesterin","2 Isis"]
[21,"Welt","3 Herrscherin","3 Horus"]
[22,"Narr","4 Herrscher","1 Osiris"]

{"sheet":"Jahreskarten","index":1,"n_rows":219,"n_cols":33,"rows_kept":219,"cut":false,"hidden":false,"merged":[]}
[]
[]
[]
["Persönliche Karten"]
[]
["Hier das Geburtsdatum im Format JJJJ, MM, TT eingeben:"]
["Jahr","Monat","Tag",null,"Vorname","Name",null,"Die Persönlichkeitskarte ist:",null,{"$f":"H13","v":19},{"$f":"IF(J7=1,\"Der Magier\",IF(J7=2,\"Die Hohepriesterin\",IF(J7=3,\"Die Herrscherin\",IF(J7=4,\"Der Herrscher\",IF(J7=5,\"Der Hierophant\",IF(J7=6,\"Die Liebenden\",IF(J7=7,\"Der Wagen\",IF(J7=8,\"Die Kraft\",IF(J7=9,\"Der Eremit\",IF(J7=10,\"Das Rad\",IF(J7=11,\"Die Gerechtigkeit\",IF(J7=12,\"Der Gehängte\",IF(J7=13,\"Der Tod\",IF(J7=14,\"Die Mässigkeit\",IF(J7=15,\"Der Teufel\",IF(J7=16,\"Der Turm\",IF(J7=17,\"Der Stern\",IF(J7=18,\"Der Mond\",IF(J7=19,\"Die Sonne\",IF(J7=20,\"Das Gericht\",IF(J7=21,\"Die Welt\",IF(J7=22,\"Der Narr\"))))))))))))))))))))))","v":"Die Sonne"}]
[1962,7,12,null,"Zum ","Beispiel",null,"Die Wesenskarte ist:",null,{"$f":"I13","v":10},{"$f":"IF(J8=1,\"Der Magier\",IF(J8=2,\"Die Hohepriesterin\",IF(J8=3,\"Die Herrscherin\",IF(J8=4,\"Der Herrscher\",IF(J8=5,\"Der Hierophant\",IF(J8=6,\"Die Liebenden\",IF(J8=7,\"Der Wagen\",IF(J8=8,\"Die Kraft\",IF(J8=9,\"Der Eremit\",IF(J8=10,\"Das Rad\",IF(J8=11,\"Die Gerechtigkeit\",IF(J8=12,\"Der Gehängte\",IF(J8=13,\"Der Tod\",IF(J8=14,\"Die Mässigkeit\",IF(J8=15,\"Der Teufel\",IF(J8=16,\"Der Turm\",IF(J8=17,\"Der Stern\",IF(J8=18,\"Der Mond\",IF(J8=19,\"Die Sonne\",IF(J8=20,\"Das Gericht\",IF(J8=21,\"Die Welt\",IF(J8=22,\"Der Narr\"))))))))))))))))))))))","v":"Das Rad"}]
[]
[]
[]
["Geburtsjahr","Alter","Jahr",null,null,null,"Quersumme","Jahreskarte","Wesenskarte","Karmisches Jahr"]
[{"$f":"$A$8","v":1962},0,{"$f":"SUM(A13:B13)","v":1962},{"$f":"$B$8","v":7},{"$f":"$C$8","v":12},{"$f":"SUM(C13:E13)","v":1981},{"$f":"SUMPRODUCT(MID(F13,ROW(INDIRECT(\"1:\"&LEN(F13))),1)*1)","v":19},{"$f":"IF(G13>22,SUMPRODUCT(VALUE(MID(G13,ROW(INDIRECT(\"$b1:$A\"&LEN(G13))),1))),G13)","v":19},{"$f":"IF(H13>9,SUMPRODUCT(VALUE(MID(H13,ROW(INDIRECT(\"$b1:$A\"&LEN(H13))),1))),H13+9)","v":10},{"$f":"SUM($C13:$E13)","v":1981}]
[{"$f":"$A$8","v":1962},1,{"$f":"SUM(A14:B14)","v":1963},{"$f":"$B$8","v":7},{"$f":"$C$8","v":12},{"$f":"SUM(C14:E14)","v":1982},{"$f":"SUMPRODUCT(MID(F14,ROW(INDIRECT(\"1:\"&LEN(F14))),1)*1)","v":20},{"$f":"IF(G14>22,SUMPRODUCT(VALUE(MID(G14,ROW(INDIRECT(\"$b1:$A\"&LEN(G14))),1))),G14)","v":20},{"$f":"IF(H14>9,SUMPRODUCT(VALUE(MID(H14,ROW(INDIRECT(\"$b1:$A\"&LEN(H14))),1))),H14+9)","v":2}]
[1962,2,1964,7,12,1983,21,21,3]
[1962,3,1965,7,12,1984,22,22,4]
[1962,4,1966,7,12,1985,23,5,14]
[1962,5,1967,7,12,1986,24,6,15]
[1962,6,1968,7,12,1987,25,7,16]
[1962,7,1969,7,12,1988,26,8,17]
[1962,8,1970,7,12,1989,27,9,18]
[1962,9,1971,7,12,1990,{"$f":"SUMPRODUCT(MID(F22,ROW(INDIRECT(\"1:\"&LEN(F22))),1)*1)","v":19},19,10]
[1962,10,1972,7,12,1991,20,20,2]
[1962,11,1973,7,12,1992,21,21,3]
[1962,12,1974,7,12,1993,22,22,4]
[1962,13,1975,7,12,1994,23,5,14]
[1962,14,1976,7,12,1995,24,6,15]
[1962,15,1977,7,12,1996,25,7,16]
[1962,16,1978,7,12,1997,26,8,17]
[1962,17,1979,7,12,1998,27,9,18]
[1962,18,1980,7,12,1999,28,10,1]
[1962,19,1981,7,12,2000,2,2,11]
[1962,20,1982,7,12,2001,3,3,12]
[1962,21,1983,7,12,2002,4,4,13]
[1962,22,1984,7,12,2003,5,5,14]
[1962,23,1985,7,12,2004,6,6,15]
[1962,24,1986,7,12,2005,7,7,16]
[1962,25,1987,7,12,2006,8,8,17]
[1962,26,1988,7,12,2007,9,9,18]
[1962,27,1989,7,12,2008,10,10,1]
[1962,28,1990,7,12,2009,11,11,2]
[1962,29,1991,7,12,2010,3,3,12]
[1962,30,1992,7,12,2011,4,4,13]
[1962,31,1993,7,12,2012,5,5,14]
[1962,32,1994,7,12,2013,6,6,15]
[1962,33,1995,7,12,2014,7,7,16]
[1962,34,1996,7,12,2015,8,8,17]
[1962,35,1997,7,12,2016,9,9,18]
[1962,36,1998,7,12,2017,10,10,1]
[1962,37,1999,7,12,2018,11,11,2]
[1962,38,2000,7,12,2019,12,12,3]
[1962,39,2001,7,12,2020,4,4,13]
[1962,40,2002,7,12,2021,5,5,14]
[1962,41,2003,7,12,2022,6,6,15]
[1962,42,2004,7,12,2023,7,7,16]
[1962,43,2005,7,12,2024,8,8,17]
[1962,44,2006,7,12,2025,9,9,18]
[1962,45,2007,7,12,2026,10,10,1]
[1962,46,2008,7,12,2027,11,11,2]
[1962,47,2009,7,12,2028,12,12,3]
[1962,48,2010,7,12,2029,13,13,4]
[1962,49,2011,7,12,2030,5,5,14]
[1962,50,2012,7,12,2031,6,6,15]
[1962,51,2013,7,12,2032,7,7,16]
[1962,52,2014,7,12,2033,8,8,17]
[1962,53,2015,7,12,2034,9,9,18]
[1962,54,2016,7,12,2035,10,10,1]
[1962,55,2017,7,12,2036,11,11,2]
[1962,56,2018,7,12,2037,12,12,3]
[1962,57,2019,7,12,2038,13,13,4]
[1962,58,2020,7,12,2039,14,14,5]
[1962,59,2021,7,12,2040,6,6,15]
[1962,60,2022,7,12,2041,7,7,16]
[1962,61,2023,7,12,2042,8,8,17]
[1962,62,2024,7,12,2043,9,9,18]
[1962,63,2025,7,12,2044,10,10,1]
[1962,64,2026,7,12,2045,11,11,2]
[{"$f":"$A$8","v":1962},65,{"$f":"SUM(A78:B78)","v":2027},{"$f":"$B$8","v":7},{"$f":"$C$8","v":12},{"$f":"SUM(C78:E78)","v":2046},12,{"$f":"IF(G78>22,SUMPRODUCT(VALUE(MID(G78,ROW(INDIRECT(\"$b1:$A\"&LEN(G78))),1))),G78)","v":12},{"$f":"IF(H78>9,SUMPRODUCT(VALUE(MID(H78,ROW(INDIRECT(\"$b1:$A\"&LEN(H78))),1))),H78+9)","v":3}]
[1962,66,2028,7,12,2047,13,13,4]
[1962,67,2029,7,12,2048,14,14,5]
[1962,68,2030,7,12,2049,15,15,6]
[1962,69,2031,7,12,2050,7,7,16]
[1962,70,2032,7,12,2051,8,8,17]
[1962,71,2033,7,12,2052,9,9,18]
[1962,72,2034,7,12,2053,10,10,1]
[1962,73,2035,7,12,2054,{"$f":"SUMPRODUCT(MID(F86,ROW(INDIRECT(\"1:\"&LEN(F86))),1)*1)","v":11},11,2]
[1962,74,2036,7,12,2055,12,12,3]
[1962,75,2037,7,12,2056,13,13,4]
[1962,76,2038,7,12,2057,14,14,5]
[1962,77,2039,7,12,2058,15,15,6]
[1962,78,2040,7,12,2059,16,16,7]
[1962,79,2041,7,12,2060,8,8,17]
[1962,80,2042,7,12,2061,9,9,18]
[1962,81,2043,7,12,2062,10,10,1]
[1962,82,2044,7,12,2063,11,11,2]
[1962,83,2045,7,12,2064,12,12,3]
[1962,84,2046,7,12,2065,13,13,4]
[1962,85,2047,7,12,2066,14,14,5]
[1962,86,2048,7,12,2067,15,15,6]
[1962,87,2049,7,12,2068,16,16,7]
[1962,88,2050,7,12,2069,17,17,8]
[1962,89,2051,7,12,2070,9,9,18]
[1962,90,2052,7,12,2071,10,10,1]
[1962,91,2053,7,12,2072,11,11,2]
[1962,92,2054,7,12,2073,12,12,3]
[1962,93,2055,7,12,2074,13,13,4]
[1962,94,2056,7,12,2075,14,14,5]
[1962,95,2057,7,12,2076,15,15,6]
[1962,96,2058,7,12,2077,16,16,7]
[1962,97,2059,7,12,2078,17,17,8]
[1962,98,2060,7,12,2079,18,18,9]
[1962,99,2061,7,12,2080,10,10,1]
[]
[]
[]
[]
["Häufigkeit der einzelnen Jahreskarten:"]
[]
["1 Magier",{"$f":"COUNTIF($H$13:$H$112,1)","v":0},null,null,null,null,null,null,null,null,null,"1 Der Magier","2 Die Hohepriesterin","3 Die Herrscherin","4 Der Herrscher","5 Der Hierophant","6 Die Liebenden","7 Der Wagen","8 Die Kraft","9 Der Eremit","10 Das Rad","11 Die Gerechtigkeit","12 Der Gehängte","13 Der Tod","14 Die Mässigkeit","15 Der Teufel","16 Der Turm","17 Der Stern","18 Der Mond","19 Die Sonne","20 Das Gericht","21 Die Welt","22 Der Narr"]
["2 Hohepriesterin",{"$f":"COUNTIF($H$13:$H$112,2)","v":1},null,null,null,null,null,null,null,null,null,{"$f":"IF(H13=1,C13,0)","v":0},{"$f":"IF(H13=2,C13,0)","v":0},{"$f":"IF(H13=3,C13,0)","v":0},{"$f":"IF(H13=4,C13,0)","v":0},{"$f":"IF(H13=5,C13,0)","v":0},{"$f":"IF(H13=6,C13,0)","v":0},{"$f":"IF(H13=7,C13,0)","v":0},{"$f":"IF(H13=8,C13,0)","v":0},{"$f":"IF(H13=9,C13,0)","v":0},{"$f":"IF(H13=10,C13,0)","v":0},{"$f":"IF(H13=11,C13,0)","v":0},{"$f":"IF(H13=12,C13,0)","v":0},{"$f":"IF(H13=13,C13,0)","v":0},{"$f":"IF(H13=14,C13,0)","v":0},{"$f":"IF(H13=15,C13,0)","v":0},{"$f":"IF(H13=16,C13,0)","v":0},{"$f":"IF(H13=17,C13,0)","v":0},{"$f":"IF(H13=18,C13,0)","v":0},{"$f":"IF(H13=19,C13,0)","v":1962},{"$f":"IF(H13=20,C13,0)","v":0},{"$f":"IF(H13=21,C13,0)","v":0},{"$f":"IF(H13=22,C13,0)","v":0}]
["3 Herrscherin",{"$f":"COUNTIF($H$13:$H$112,3)","v":2},null,null,null,null,null,null,null,null,null,{"$f":"IF(H14=1,C14,0)","v":0},{"$f":"IF(H14=2,C14,0)","v":0},{"$f":"IF(H14=3,C14,0)","v":0},{"$f":"IF(H14=4,C14,0)","v":0},{"$f":"IF(H14=5,C14,0)","v":0},{"$f":"IF(H14=6,C14,0)","v":0},{"$f":"IF(H14=7,C14,0)","v":0},{"$f":"IF(H14=8,C14,0)","v":0},{"$f":"IF(H14=9,C14,0)","v":0},{"$f":"IF(H14=10,C14,0)","v":0},{"$f":"IF(H14=11,C14,0)","v":0},{"$f":"IF(H14=12,C14,0)","v":0},{"$f":"IF(H14=13,C14,0)","v":0},{"$f":"IF(H14=14,C14,0)","v":0},{"$f":"IF(H14=15,C14,0)","v":0},{"$f":"IF(H14=16,C14,0)","v":0},{"$f":"IF(H14=17,C14,0)","v":0},{"$f":"IF(H14=18,C14,0)","v":0},{"$f":"IF(H14=19,C14,0)","v":0},{"$f":"IF(H14=20,C14,0)","v":1963},{"$f":"IF(H14=21,C14,0)","v":0},{"$f":"IF(H14=22,C14,0)","v":0}]
["4 Herrscher",{"$f":"COUNTIF($H$13:$H$112,4)","v":3},null,null,null,null,null,null,null,null,null,{"$f":"IF(H15=1,C15,0)","v":0},0,0,0,0,0,0,0,0,0,0,0,0,0,0,0,0,0,0,0,1964,0]
["5 Hierophant",{"$f":"COUNTIF($H$13:$H$112,5)","v":6},null,null,null,null,null,null,null,null,null,0,0,0,0,0,0,0,0,0,0,0,0,0,0,0,0,0,0,0,0,0,1965]
["6 Liebende",{"$f":"COUNTIF($H$13:$H$112,6)","v":7},null,null,null,null,null,null,null,null,null,0,0,0,0,1966,0,0,0,0,0,0,0,0,0,0,0,0,0,0,0,0,0]
["7 Wagen",{"$f":"COUNTIF($H$13:$H$112,7)","v":8},null,null,null,null,null,null,null,null,null,0,0,0,0,0,1967,0,0,0,0,0,0,0,0,0,0,0,0,0,0,0,0]
["8 Kraft",{"$f":"COUNTIF($H$13:$H$112,8)","v":9},null,null,null,null,null,null,null,null,null,0,0,0,0,0,0,1968,0,0,0,0,0,0,0,0,0,0,0,0,0,0,0]
["9 Eremit",{"$f":"COUNTIF($H$13:$H$112,9)","v":10},null,null,null,null,null,null,null,null,null,0,0,0,0,0,0,0,1969,0,0,0,0,0,0,0,0,0,0,0,0,0,0]
["10 Rad",{"$f":"COUNTIF($H$13:$H$112,10)","v":10},null,null,null,null,null,null,null,null,null,0,0,0,0,0,0,0,0,1970,0,0,0,0,0,0,0,0,0,0,0,0,0]
["11 Gerechtigkeit",{"$f":"COUNTIF($H$13:$H$112,11)","v":8},null,null,null,null,null,null,null,null,null,0,0,0,0,0,0,0,0,0,0,0,0,0,0,0,0,0,0,1971,0,0,0]
["12 Gehängter",{"$f":"COUNTIF($H$13:$H$112,12)","v":7},null,null,null,null,null,null,null,null,null,0,0,0,0,0,0,0,0,0,0,0,0,0,0,0,0,0,0,0,1972,0,0]
["13 Tod",{"$f":"COUNTIF($H$13:$H$112,13)","v":6},null,null,null,null,null,null,null,null,null,0,0,0,0,0,0,0,0,0,0,0,0,0,0,0,0,0,0,0,0,1973,0]
["14 Mässigkeit",{"$f":"COUNTIF($H$13:$H$112,14)","v":5},null,null,null,null,null,null,null,null,null,0,0,0,0,0,0,0,0,0,0,0,0,0,0,0,0,0,0,0,0,0,1974]
["15 Teufel",{"$f":"COUNTIF($H$13:$H$112,15)","v":4},null,null,null,null,null,null,null,null,null,0,0,0,0,1975,0,0,0,0,0,0,0,0,0,0,0,0,0,0,0,0,0]
["16 Turm",{"$f":"COUNTIF($H$13:$H$112,16)","v":3},null,null,null,null,null,null,null,null,null,0,0,0,0,0,1976,0,0,0,0,0,0,0,0,0,0,0,0,0,0,0,0]
["17 Stern",{"$f":"COUNTIF($H$13:$H$112,17)","v":2},null,null,null,null,null,null,null,null,null,0,0,0,0,0,0,1977,0,0,0,0,0,0,0,0,0,0,0,0,0,0,0]
["18 Mond",{"$f":"COUNTIF($H$13:$H$112,18)","v":1},null,null,null,null,null,null,null,null,null,0,0,0,0,0,0,0,1978,0,0,0,0,0,0,0,0,0,0,0,0,0,0]
["19 Sonne",{"$f":"COUNTIF($H$13:$H$112,19)","v":2},null,null,null,null,null,null,null,null,null,0,0,0,0,0,0,0,0,1979,0,0,0,0,0,0,0,0,0,0,0,0,0]
["20 Gericht",{"$f":"COUNTIF($H$13:$H$112,20)","v":2},null,null,null,null,null,null,null,null,null,0,0,0,0,0,0,0,0,0,1980,0,0,0,0,0,0,0,0,0,0,0,0]
["21 Welt",{"$f":"COUNTIF($H$13:$H$112,21)","v":2},null,null,null,null,null,null,null,null,null,0,1981,0,0,0,0,0,0,0,0,0,0,0,0,0,0,0,0,0,0,0,0]
["22 Narr",{"$f":"COUNTIF($H$13:$H$112,22)","v":2},null,null,null,null,null,null,null,null,null,0,0,1982,0,0,0,0,0,0,0,0,0,0,0,0,0,0,0,0,0,0,0]
[null,{"$f":"SUM(B119:B140)","v":100},null,null,null,null,null,null,null,null,null,0,0,0,1983,0,0,0,0,0,0,0,0,0,0,0,0,0,0,0,0,0,0]
[null,null,null,null,null,null,null,null,null,null,null,0,0,0,0,1984,0,0,0,0,0,0,0,0,0,0,0,0,0,0,0,0,0]
[null,null,null,null,null,null,null,null,null,null,null,0,0,0,0,0,1985,0,0,0,0,0,0,0,0,0,0,0,0,0,0,0,0]
[null,null,null,null,null,null,null,null,null,null,null,0,0,0,0,0,0,1986,0,0,0,0,0,0,0,0,0,0,0,0,0,0,0]
[null,null,null,null,null,null,null,null,null,null,null,0,0,0,0,0,0,0,1987,0,0,0,0,0,0,0,0,0,0,0,0,0,0]
[null,null,null,null,null,null,null,null,null,null,null,0,0,0,0,0,0,0,0,1988,0,0,0,0,0,0,0,0,0,0,0,0,0]
[null,null,null,null,null,null,null,null,null,null,null,0,0,0,0,0,0,0,0,0,1989,0,0,0,0,0,0,0,0,0,0,0,0]
[null,null,null,null,null,null,null,null,null,null,null,0,0,0,0,0,0,0,0,0,0,1990,0,0,0,0,0,0,0,0,0,0,0]
[null,null,null,null,null,null,null,null,null,null,null,0,0,1991,0,0,0,0,0,0,0,0,0,0,0,0,0,0,0,0,0,0,0]
[null,null,null,null,null,null,null,null,null,null,null,0,0,0,1992,0,0,0,0,0,0,0,0,0,0,0,0,0,0,0,0,0,0]
[null,null,null,null,null,null,null,null,null,null,null,0,0,0,0,1993,0,0,0,0,0,0,0,0,0,0,0,0,0,0,0,0,0]
[null,null,null,null,null,null,null,null,null,null,null,0,0,0,0,0,1994,0,0,0,0,0,0,0,0,0,0,0,0,0,0,0,0]
[null,null,null,null,null,null,null,null,null,null,null,0,0,0,0,0,0,1995,0,0,0,0,0,0,0,0,0,0,0,0,0,0,0]
[null,null,null,null,null,null,null,null,null,null,null,0,0,0,0,0,0,0,1996,0,0,0,0,0,0,0,0,0,0,0,0,0,0]
[null,null,null,null,null,null,null,null,null,null,null,0,0,0,0,0,0,0,0,1997,0,0,0,0,0,0,0,0,0,0,0,0,0]
[null,null,null,null,null,null,null,null,null,null,null,0,0,0,0,0,0,0,0,0,1998,0,0,0,0,0,0,0,0,0,0,0,0]
[null,null,null,null,null,null,null,null,null,null,null,0,0,0,0,0,0,0,0,0,0,1999,0,0,0,0,0,0,0,0,0,0,0]
[null,null,null,null,null,null,null,null,null,null,null,0,0,0,0,0,0,0,0,0,0,0,2000,0,0,0,0,0,0,0,0,0,0]
[null,null,null,null,null,null,null,null,null,null,null,0,0,0,2001,0,0,0,0,0,0,0,0,0,0,0,0,0,0,0,0,0,0]
[null,null,null,null,null,null,null,null,null,null,null,0,0,0,0,2002,0,0,0,0,0,0,0,0,0,0,0,0,0,0,0,0,0]
[null,null,null,null,null,null,null,null,null,null,null,0,0,0,0,0,2003,0,0,0,0,0,0,0,0,0,0,0,0,0,0,0,0]
[null,null,null,null,null,null,null,null,null,null,null,0,0,0,0,0,0,2004,0,0,0,0,0,0,0,0,0,0,0,0,0,0,0]
[null,null,null,null,null,null,null,null,null,null,null,0,0,0,0,0,0,0,2005,0,0,0,0,0,0,0,0,0,0,0,0,0,0]
[null,null,null,null,null,null,null,null,null,null,null,0,0,0,0,0,0,0,0,2006,0,0,0,0,0,0,0,0,0,0,0,0,0]
[null,null,null,null,null,null,null,null,null,null,null,0,0,0,0,0,0,0,0,0,2007,0,0,0,0,0,0,0,0,0,0,0,0]
[null,null,null,null,null,null,null,null,null,null,null,0,0,0,0,0,0,0,0,0,0,2008,0,0,0,0,0,0,0,0,0,0,0]
[null,null,null,null,null,null,null,null,null,null,null,0,0,0,0,0,0,0,0,0,0,0,2009,0,0,0,0,0,0,0,0,0,0]
[null,null,null,null,null,null,null,null,null,null,null,0,0,0,0,0,0,0,0,0,0,0,0,2010,0,0,0,0,0,0,0,0,0]
[null,null,null,null,null,null,null,null,null,null,null,0,0,0,0,2011,0,0,0,0,0,0,0,0,0,0,0,0,0,0,0,0,0]
[null,null,null,null,null,null,null,null,null,null,null,0,0,0,0,0,2012,0,0,0,0,0,0,0,0,0,0,0,0,0,0,0,0]
[null,null,null,null,null,null,null,null,null,null,null,0,0,0,0,0,0,2013,0,0,0,0,0,0,0,0,0,0,0,0,0,0,0]
[null,null,null,null,null,null,null,null,null,null,null,0,0,0,0,0,0,0,2014,0,0,0,0,0,0,0,0,0,0,0,0,0,0]
[null,null,null,null,null,null,null,null,null,null,null,0,0,0,0,0,0,0,0,2015,0,0,0,0,0,0,0,0,0,0,0,0,0]
[null,null,null,null,null,null,null,null,null,null,null,0,0,0,0,0,0,0,0,0,2016,0,0,0,0,0,0,0,0,0,0,0,0]
[null,null,null,null,null,null,null,null,null,null,null,0,0,0,0,0,0,0,0,0,0,2017,0,0,0,0,0,0,0,0,0,0,0]
[null,null,null,null,null,null,null,null,null,null,null,0,0,0,0,0,0,0,0,0,0,0,2018,0,0,0,0,0,0,0,0,0,0]
[null,null,null,null,null,null,null,null,null,null,null,0,0,0,0,0,0,0,0,0,0,0,0,2019,0,0,0,0,0,0,0,0,0]
[null,null,null,null,null,null,null,null,null,null,null,0,0,0,0,0,0,0,0,0,0,0,0,0,2020,0,0,0,0,0,0,0,0]
[null,null,null,null,null,null,null,null,null,null,null,0,0,0,0,0,2021,0,0,0,0,0,0,0,0,0,0,0,0,0,0,0,0]
[null,null,null,null,null,null,null,null,null,null,null,0,0,0,0,0,0,2022,0,0,0,0,0,0,0,0,0,0,0,0,0,0,0]
[null,null,null,null,null,null,null,null,null,null,null,0,0,0,0,0,0,0,2023,0,0,0,0,0,0,0,0,0,0,0,0,0,0]
[null,null,null,null,null,null,null,null,null,null,null,0,0,0,0,0,0,0,0,2024,0,0,0,0,0,0,0,0,0,0,0,0,0]
[null,null,null,null,null,null,null,null,null,null,null,0,0,0,0,0,0,0,0,0,2025,0,0,0,0,0,0,0,0,0,0,0,0]
[null,null,null,null,null,null,null,null,null,null,null,0,0,0,0,0,0,0,0,0,0,2026,0,0,0,0,0,0,0,0,0,0,0]
[null,null,null,null,null,null,null,null,null,null,null,0,{"$f":"IF(H78=2,C78,0)","v":0},{"$f":"IF(H78=3,C78,0)","v":0},{"$f":"IF(H78=4,C78,0)","v":0},{"$f":"IF(H78=5,C78,0)","v":0},{"$f":"IF(H78=6,C78,0)","v":0},{"$f":"IF(H78=7,C78,0)","v":0},{"$f":"IF(H78=8,C78,0)","v":0},{"$f":"IF(H78=9,C78,0)","v":0},{"$f":"IF(H78=10,C78,0)","v":0},{"$f":"IF(H78=11,C78,0)","v":0},{"$f":"IF(H78=12,C78,0)","v":2027},{"$f":"IF(H78=13,C78,0)","v":0},{"$f":"IF(H78=14,C78,0)","v":0},{"$f":"IF(H78=15,C78,0)","v":0},{"$f":"IF(H78=16,C78,0)","v":0},{"$f":"IF(H78=17,C78,0)","v":0},{"$f":"IF(H78=18,C78,0)","v":0},{"$f":"IF(H78=19,C78,0)","v":0},{"$f":"IF(H78=20,C78,0)","v":0},{"$f":"IF(H78=21,C78,0)","v":0},{"$f":"IF(H78=22,C78,0)","v":0}]
[null,null,null,null,null,null,null,null,null,null,null,{"$f":"IF(H79=1,C79,0)","v":0},0,0,0,0,0,0,0,0,0,0,0,2028,0,0,0,0,0,0,0,0,0]
[null,null,null,null,null,null,null,null,null,null,null,0,0,0,0,0,0,0,0,0,0,0,0,0,2029,0,0,0,0,0,0,0,0]
[null,null,null,null,null,null,null,null,null,null,null,0,0,0,0,0,0,0,0,0,0,0,0,0,0,2030,0,0,0,0,0,0,0]
[null,null,null,null,null,null,null,null,null,null,null,0,0,0,0,0,0,2031,0,0,0,0,0,0,0,0,0,0,0,0,0,0,0]
[null,null,null,null,null,null,null,null,null,null,null,0,0,0,0,0,0,0,2032,0,0,0,0,0,0,0,0,0,0,0,0,0,0]
[null,null,null,null,null,null,null,null,null,null,null,0,0,0,0,0,0,0,0,2033,0,0,0,0,0,0,0,0,0,0,0,0,0]
[null,null,null,null,null,null,null,null,null,null,null,0,0,0,0,0,0,0,0,0,2034,0,0,0,0,0,0,0,0,0,0,0,0]
[null,null,null,null,null,null,null,null,null,null,null,0,0,{"$f":"IF(H86=3,C86,0)","v":0},0,0,0,0,0,0,0,2035,0,0,0,0,0,0,0,0,0,0,0]
[null,null,null,null,null,null,null,null,null,null,null,0,0,{"$f":"IF(H87=3,C87,0)","v":0},0,0,0,0,0,0,0,0,2036,0,0,0,0,0,0,0,0,0,0]
[null,null,null,null,null,null,null,null,null,null,null,0,0,0,0,0,0,0,0,0,0,0,0,2037,0,0,0,0,0,0,0,0,0]
[null,null,null,null,null,null,null,null,null,null,null,0,0,0,0,0,0,0,0,0,0,0,0,0,2038,0,0,0,0,0,0,0,0]
[null,null,null,null,null,null,null,null,null,null,null,0,0,0,0,0,0,0,0,0,0,0,0,0,0,2039,0,0,0,0,0,0,0]
[null,null,null,null,null,null,null,null,null,null,null,0,0,0,0,0,0,0,0,0,0,0,0,0,0,0,2040,0,0,0,0,0,0]
[null,null,null,null,null,null,null,null,null,null,null,0,0,0,0,0,0,0,2041,0,0,0,0,0,0,0,0,0,0,0,0,0,0]
[null,null,null,null,null,null,null,null,null,null,null,0,0,0,0,0,0,0,0,2042,0,0,0,0,0,0,0,0,0,0,0,0,0]
[null,null,null,null,null,null,null,null,null,null,null,0,0,0,0,0,0,0,0,0,2043,0,0,0,0,0,0,0,0,0,0,0,0]
[null,null,null,null,null,null,null,null,null,null,null,0,0,0,0,0,0,0,0,0,0,2044,0,0,0,0,0,0,0,0,0,0,0]
[null,null,null,null,null,null,null,null,null,null,null,0,0,0,0,0,0,0,0,0,0,0,2045,0,0,0,0,0,0,0,0,0,0]
[null,null,null,null,null,null,null,null,null,null,null,0,0,0,0,0,0,0,0,0,0,0,0,2046,0,0,0,0,0,0,0,0,0]
[null,null,null,null,null,null,null,null,null,null,null,0,0,0,0,0,0,0,0,0,0,0,0,0,2047,0,0,0,0,0,0,0,0]
[null,null,null,null,null,null,null,null,null,null,null,0,0,0,0,0,0,0,0,0,0,0,0,0,0,2048,0,0,0,0,0,0,0]
[null,null,null,null,null,null,null,null,null,null,null,0,0,0,0,0,0,0,0,0,0,0,0,0,0,0,2049,0,0,0,0,0,0]
[null,null,null,null,null,null,null,null,null,null,null,0,0,0,0,0,0,0,0,0,0,0,0,0,0,0,0,2050,0,0,0,0,0]
[null,null,null,null,null,null,null,null,null,null,null,0,0,0,0,0,0,0,0,2051,0,0,0,0,0,0,0,0,0,0,0,0,0]
[null,null,null,null,null,null,null,null,null,null,null,0,0,0,0,0,0,0,0,0,2052,0,0,0,0,0,0,0,0,0,0,0,0]
[null,null,null,null,null,null,null,null,null,null,null,0,0,0,0,0,0,0,0,0,0,2053,0,0,0,0,0,0,0,0,0,0,0]
[null,null,null,null,null,null,null,null,null,null,null,0,0,0,0,0,0,0,0,0,0,0,2054,0,0,0,0,0,0,0,0,0,0]
[null,null,null,null,null,null,null,null,null,null,null,0,0,0,0,0,0,0,0,0,0,0,0,2055,0,0,0,0,0,0,0,0,0]
[null,null,null,null,null,null,null,null,null,null,null,0,0,0,0,0,0,0,0,0,0,0,0,0,2056,0,0,0,0,0,0,0,0]
[null,null,null,null,null,null,null,null,null,null,null,0,0,0,0,0,0,0,0,0,0,0,0,0,0,2057,0,0,0,0,0,0,0]
[null,null,null,null,null,null,null,null,null,null,null,0,0,0,0,0,0,0,0,0,0,0,0,0,0,0,2058,0,0,0,0,0,0]
[null,null,null,null,null,null,null,null,null,null,null,0,0,0,0,0,0,0,0,0,0,0,0,0,0,0,0,2059,0,0,0,0,0]
[null,null,null,null,null,null,null,null,null,null,null,0,0,0,0,0,0,0,0,0,0,0,0,0,0,0,0,0,2060,0,0,0,0]
[null,null,null,null,null,null,null,null,null,null,null,0,0,0,0,0,0,0,0,0,2061,0,0,0,0,0,0,0,0,0,0,0,0]

{"sheet":"Horoskop","index":2,"n_rows":34,"n_cols":9,"rows_kept":34,"cut":false,"hidden":true,"merged":[]}
[]
[]
[]
[]
[]
[]
[]
[]
[]
[]
[]
[]
[]
[]
[]
[]
[]
[]
[]
[]
[]
["Jahr JJJJ","Monat","Tag","Stunde","Vorname","Name"]
[1964,8,28,7,"Beispiel","Aufbau 3"]
[]
[]
[]
["Das Horoskop","für",null,{"$f":"$E$23","v":"Beispiel"},{"$f":"$F$23","v":"Aufbau 3"},null,"Resultat","Bewusst","Unbewusst"]
["Jahr","Atziluth","Feuer","König","Geist, wollen",{"$f":"$A$23","v":1964},{"$f":"SUMPRODUCT(MID(F28,ROW(INDIRECT(\"1:\"&LEN(F28))),1)*1)","v":20},{"$f":"IF(G28>22,SUMPRODUCT(VALUE(MID(G28,ROW(INDIRECT(\"$b1:$A\"&LEN(G28))),1))),G28)","v":20},{"$f":"IF(H28>9,SUMPRODUCT(VALUE(MID(H28,ROW(INDIRECT(\"$b1:$A\"&LEN(H28))),1))),H28+9)","v":2}]
[]
["Monat","Briah","Wasser","Königin","Seele, fühlen",{"$f":"$A$23+$B$23","v":1972},{"$f":"SUMPRODUCT(MID(F30,ROW(INDIRECT(\"1:\"&LEN(F30))),1)*1)","v":19},{"$f":"IF(G30>22,SUMPRODUCT(VALUE(MID(G30,ROW(INDIRECT(\"$b1:$A\"&LEN(G30))),1))),G30)","v":19},{"$f":"IF(H30>9,SUMPRODUCT(VALUE(MID(H30,ROW(INDIRECT(\"$b1:$A\"&LEN(H30))),1))),H30+9)","v":10}]
[]
["Tag","Jetzirah","Luft","Ritter","Verstand, denken",{"$f":"$A$23+$B$23+$C$23","v":2000},{"$f":"SUMPRODUCT(MID(F32,ROW(INDIRECT(\"1:\"&LEN(F32))),1)*1)","v":2},{"$f":"IF(G32>22,SUMPRODUCT(VALUE(MID(G32,ROW(INDIRECT(\"$b1:$A\"&LEN(G32))),1))),G32)","v":2},{"$f":"IF(H32>9,SUMPRODUCT(VALUE(MID(H32,ROW(INDIRECT(\"$b1:$A\"&LEN(H32))),1))),H32+9)","v":11}]
[]
["Stunde","Assiah","Erde","Bube","Körper, handeln",{"$f":"$A$23+$B$23+$C$23+$D$23","v":2007},{"$f":"SUMPRODUCT(MID(F34,ROW(INDIRECT(\"1:\"&LEN(F34))),1)*1)","v":9},{"$f":"IF(G34>22,SUMPRODUCT(VALUE(MID(G34,ROW(INDIRECT(\"$b1:$A\"&LEN(G34))),1))),G34)","v":9},{"$f":"IF(H34>9,SUMPRODUCT(VALUE(MID(H34,ROW(INDIRECT(\"$b1:$A\"&LEN(H34))),1))),H34+9)","v":18}]

{"sheet":"Allg. Jahre","index":3,"n_rows":132,"n_cols":20,"rows_kept":132,"cut":false,"hidden":false,"merged":[[4,2,4,3],[4,9,4,10],[4,16,4,17]]}
["Jahreskarten"]
[]
[]
[]
["Jahr",null,"Jahreskarte",null,"Konstellation","Gruppe",null,"Jahr",null,"Jahreskarte",null,"Konstellation","Gruppe",null,"Jahr",null,"Jahreskarte",null,"Konstellation","Gruppe"]
[1800,{"$f":"SUMPRODUCT(MID(A6,ROW(INDIRECT(\"1:\"&LEN(A6))),1)*1)","v":9},{"$f":"IF(B6>22,SUMPRODUCT(VALUE(MID(B6,ROW(INDIRECT(\"$b1:$A\"&LEN(B6))),1))),B6)","v":9},{"$f":"VLOOKUP(C6,$A$111:$D$132,2,FALSE)","v":"Eremit"},{"$f":"VLOOKUP(C6,$A$111:$D$132,3,FALSE)","v":"9 Eremit"},{"$f":"VLOOKUP(C6,$A$111:$D$132,4,FALSE)","v":"3 Horus"},null,1900,{"$f":"SUMPRODUCT(MID(H6,ROW(INDIRECT(\"1:\"&LEN(H6))),1)*1)","v":10},{"$f":"IF(I6>22,SUMPRODUCT(VALUE(MID(I6,ROW(INDIRECT(\"$b1:$A\"&LEN(I6))),1))),I6)","v":10},{"$f":"VLOOKUP(J6,$A$111:$D$132,2,FALSE)","v":"Rad"},{"$f":"VLOOKUP(J6,$A$111:$D$132,3,FALSE)","v":"1 Magier"},{"$f":"VLOOKUP(J6,$A$111:$D$132,4,FALSE)","v":"1 Osiris"},null,2000,{"$f":"SUMPRODUCT(MID(O6,ROW(INDIRECT(\"1:\"&LEN(O6))),1)*1)","v":2},{"$f":"IF(P6>22,SUMPRODUCT(VALUE(MID(P6,ROW(INDIRECT(\"$b1:$A\"&LEN(P6))),1))),P6)","v":2},{"$f":"VLOOKUP(Q6,$A$111:$D$132,2,FALSE)","v":"Hohepriesterin"},{"$f":"VLOOKUP(Q6,$A$111:$D$132,3,FALSE)","v":"2 Hohepriesterin"},{"$f":"VLOOKUP(Q6,$A$111:$D$132,4,FALSE)","v":"2 Isis"}]
[1801,{"$f":"SUMPRODUCT(MID(A7,ROW(INDIRECT(\"1:\"&LEN(A7))),1)*1)","v":10},{"$f":"IF(B7>22,SUMPRODUCT(VALUE(MID(B7,ROW(INDIRECT(\"$b1:$A\"&LEN(B7))),1))),B7)","v":10},{"$f":"VLOOKUP(C7,$A$111:$D$132,2,FALSE)","v":"Rad"},{"$f":"VLOOKUP(C7,$A$111:$D$132,3,FALSE)","v":"1 Magier"},{"$f":"VLOOKUP(C7,$A$111:$D$132,4,FALSE)","v":"1 Osiris"},null,1901,{"$f":"SUMPRODUCT(MID(H7,ROW(INDIRECT(\"1:\"&LEN(H7))),1)*1)","v":11},{"$f":"IF(I7>22,SUMPRODUCT(VALUE(MID(I7,ROW(INDIRECT(\"$b1:$A\"&LEN(I7))),1))),I7)","v":11},{"$f":"VLOOKUP(J7,$A$111:$D$132,2,FALSE)","v":"Gerechtigkeit"},{"$f":"VLOOKUP(J7,$A$111:$D$132,3,FALSE)","v":"2 Hohepriesterin"},{"$f":"VLOOKUP(J7,$A$111:$D$132,4,FALSE)","v":"2 Isis"},null,2001,{"$f":"SUMPRODUCT(MID(O7,ROW(INDIRECT(\"1:\"&LEN(O7))),1)*1)","v":3},{"$f":"IF(P7>22,SUMPRODUCT(VALUE(MID(P7,ROW(INDIRECT(\"$b1:$A\"&LEN(P7))),1))),P7)","v":3},{"$f":"VLOOKUP(Q7,$A$111:$D$132,2,FALSE)","v":"Herrscherin"},{"$f":"VLOOKUP(Q7,$A$111:$D$132,3,FALSE)","v":"3 Herrscherin"},{"$f":"VLOOKUP(Q7,$A$111:$D$132,4,FALSE)","v":"3 Horus"}]
[1802,11,11,"Gerechtigkeit","2 Hohepriesterin","2 Isis",null,1902,12,12,"Gehängter","3 Herrscherin","3 Horus",null,2002,4,4,"Herrscher","4 Herrscher","1 Osiris"]
[1803,12,12,"Gehängter","3 Herrscherin","3 Horus",null,1903,13,13,"Tod","4 Herrscher","1 Osiris",null,2003,5,5,"Hierophant","5 Hierophant","2 Isis"]
[1804,13,13,"Tod","4 Herrscher","1 Osiris",null,1904,14,14,"Mässigkeit","5 Hierophant","2 Isis",null,2004,6,6,"Liebende","6 Liebende","3 Horus"]
[1805,14,14,"Mässigkeit","5 Hierophant","2 Isis",null,1905,15,15,"Teufel","6 Liebende","3 Horus",null,2005,7,7,"Wagen","7 Wagen","1 Osiris"]
[1806,15,15,"Teufel","6 Liebende","3 Horus",null,1906,16,16,"Turm","7 Wagen","1 Osiris",null,2006,8,8,"Kraft","8 Kraft","2 Isis"]
[1807,16,16,"Turm","7 Wagen","1 Osiris",null,1907,17,17,"Stern","8 Kraft","2 Isis",null,2007,9,9,"Eremit","9 Eremit","3 Horus"]
[1808,17,17,"Stern","8 Kraft","2 Isis",null,1908,18,18,"Mond","9 Eremit","3 Horus",null,2008,10,10,"Rad","1 Magier","1 Osiris"]
[1809,18,18,"Mond","9 Eremit","3 Horus",null,1909,19,19,"Sonne","1 Magier","1 Osiris",null,2009,11,11,"Gerechtigkeit","2 Hohepriesterin","2 Isis"]
[1810,10,10,"Rad","1 Magier","1 Osiris",null,1910,11,11,"Gerechtigkeit","2 Hohepriesterin","2 Isis",null,2010,3,3,"Herrscherin","3 Herrscherin","3 Horus"]
[1811,11,11,"Gerechtigkeit","2 Hohepriesterin","2 Isis",null,1911,12,12,"Gehängter","3 Herrscherin","3 Horus",null,2011,4,4,"Herrscher","4 Herrscher","1 Osiris"]
[1812,12,12,"Gehängter","3 Herrscherin","3 Horus",null,1912,13,13,"Tod","4 Herrscher","1 Osiris",null,2012,5,5,"Hierophant","5 Hierophant","2 Isis"]
[1813,13,13,"Tod","4 Herrscher","1 Osiris",null,1913,14,14,"Mässigkeit","5 Hierophant","2 Isis",null,2013,6,6,"Liebende","6 Liebende","3 Horus"]
[1814,14,14,"Mässigkeit","5 Hierophant","2 Isis",null,1914,15,15,"Teufel","6 Liebende","3 Horus",null,2014,7,7,"Wagen","7 Wagen","1 Osiris"]
[1815,15,15,"Teufel","6 Liebende","3 Horus",null,1915,16,16,"Turm","7 Wagen","1 Osiris",null,2015,8,8,"Kraft","8 Kraft","2 Isis"]
[1816,16,16,"Turm","7 Wagen","1 Osiris",null,1916,17,17,"Stern","8 Kraft","2 Isis",null,2016,9,9,"Eremit","9 Eremit","3 Horus"]
[1817,17,17,"Stern","8 Kraft","2 Isis",null,1917,18,18,"Mond","9 Eremit","3 Horus",null,2017,10,10,"Rad","1 Magier","1 Osiris"]
[1818,18,18,"Mond","9 Eremit","3 Horus",null,1918,19,19,"Sonne","1 Magier","1 Osiris",null,2018,11,11,"Gerechtigkeit","2 Hohepriesterin","2 Isis"]
[1819,19,19,"Sonne","1 Magier","1 Osiris",null,1919,20,20,"Gericht","2 Hohepriesterin","2 Isis",null,2019,12,12,"Gehängter","3 Herrscherin","3 Horus"]
[1820,11,11,"Gerechtigkeit","2 Hohepriesterin","2 Isis",null,1920,12,12,"Gehängter","3 Herrscherin","3 Horus",null,2020,4,4,"Herrscher","4 Herrscher","1 Osiris"]
[1821,12,12,"Gehängter","3 Herrscherin","3 Horus",null,1921,13,13,"Tod","4 Herrscher","1 Osiris",null,2021,5,5,"Hierophant","5 Hierophant","2 Isis"]
[1822,13,13,"Tod","4 Herrscher","1 Osiris",null,1922,14,14,"Mässigkeit","5 Hierophant","2 Isis",null,2022,6,6,"Liebende","6 Liebende","3 Horus"]
[1823,14,14,"Mässigkeit","5 Hierophant","2 Isis",null,1923,15,15,"Teufel","6 Liebende","3 Horus",null,2023,7,7,"Wagen","7 Wagen","1 Osiris"]
[1824,15,15,"Teufel","6 Liebende","3 Horus",null,1924,16,16,"Turm","7 Wagen","1 Osiris",null,2024,8,8,"Kraft","8 Kraft","2 Isis"]
[1825,16,16,"Turm","7 Wagen","1 Osiris",null,1925,17,17,"Stern","8 Kraft","2 Isis",null,2025,9,9,"Eremit","9 Eremit","3 Horus"]
[1826,17,17,"Stern","8 Kraft","2 Isis",null,1926,18,18,"Mond","9 Eremit","3 Horus",null,2026,10,10,"Rad","1 Magier","1 Osiris"]
[1827,18,18,"Mond","9 Eremit","3 Horus",null,1927,19,19,"Sonne","1 Magier","1 Osiris",null,2027,11,11,"Gerechtigkeit","2 Hohepriesterin","2 Isis"]
[1828,19,19,"Sonne","1 Magier","1 Osiris",null,1928,20,20,"Gericht","2 Hohepriesterin","2 Isis",null,2028,12,12,"Gehängter","3 Herrscherin","3 Horus"]
[1829,20,20,"Gericht","2 Hohepriesterin","2 Isis",null,1929,21,21,"Welt","3 Herrscherin","3 Horus",null,2029,13,13,"Tod","4 Herrscher","1 Osiris"]
[1830,12,12,"Gehängter","3 Herrscherin","3 Horus",null,1930,13,13,"Tod","4 Herrscher","1 Osiris",null,2030,5,5,"Hierophant","5 Hierophant","2 Isis"]
[1831,13,13,"Tod","4 Herrscher","1 Osiris",null,1931,14,14,"Mässigkeit","5 Hierophant","2 Isis",null,2031,6,6,"Liebende","6 Liebende","3 Horus"]
[1832,14,14,"Mässigkeit","5 Hierophant","2 Isis",null,1932,15,15,"Teufel","6 Liebende","3 Horus",null,2032,7,7,"Wagen","7 Wagen","1 Osiris"]
[1833,15,15,"Teufel","6 Liebende","3 Horus",null,1933,16,16,"Turm","7 Wagen","1 Osiris",null,2033,8,8,"Kraft","8 Kraft","2 Isis"]
[1834,16,16,"Turm","7 Wagen","1 Osiris",null,1934,17,17,"Stern","8 Kraft","2 Isis",null,2034,9,9,"Eremit","9 Eremit","3 Horus"]
[1835,17,17,"Stern","8 Kraft","2 Isis",null,1935,18,18,"Mond","9 Eremit","3 Horus",null,2035,10,10,"Rad","1 Magier","1 Osiris"]
[1836,18,18,"Mond","9 Eremit","3 Horus",null,1936,19,19,"Sonne","1 Magier","1 Osiris",null,2036,11,11,"Gerechtigkeit","2 Hohepriesterin","2 Isis"]
[1837,19,19,"Sonne","1 Magier","1 Osiris",null,1937,20,20,"Gericht","2 Hohepriesterin","2 Isis",null,2037,12,12,"Gehängter","3 Herrscherin","3 Horus"]
[1838,20,20,"Gericht","2 Hohepriesterin","2 Isis",null,1938,21,21,"Welt","3 Herrscherin","3 Horus",null,2038,13,13,"Tod","4 Herrscher","1 Osiris"]
[1839,21,21,"Welt","3 Herrscherin","3 Horus",null,1939,22,22,"Narr","4 Herrscher","1 Osiris",null,2039,14,14,"Mässigkeit","5 Hierophant","2 Isis"]
[1840,13,13,"Tod","4 Herrscher","1 Osiris",null,1940,14,14,"Mässigkeit","5 Hierophant","2 Isis",null,2040,6,6,"Liebende","6 Liebende","3 Horus"]
[1841,14,14,"Mässigkeit","5 Hierophant","2 Isis",null,1941,15,15,"Teufel","6 Liebende","3 Horus",null,2041,7,7,"Wagen","7 Wagen","1 Osiris"]
[1842,15,15,"Teufel","6 Liebende","3 Horus",null,1942,16,16,"Turm","7 Wagen","1 Osiris",null,2042,8,8,"Kraft","8 Kraft","2 Isis"]
[1843,16,16,"Turm","7 Wagen","1 Osiris",null,1943,17,17,"Stern","8 Kraft","2 Isis",null,2043,9,9,"Eremit","9 Eremit","3 Horus"]
[1844,17,17,"Stern","8 Kraft","2 Isis",null,1944,18,18,"Mond","9 Eremit","3 Horus",null,2044,10,10,"Rad","1 Magier","1 Osiris"]
[1845,18,18,"Mond","9 Eremit","3 Horus",null,1945,19,19,"Sonne","1 Magier","1 Osiris",null,2045,11,11,"Gerechtigkeit","2 Hohepriesterin","2 Isis"]
[1846,19,19,"Sonne","1 Magier","1 Osiris",null,1946,20,20,"Gericht","2 Hohepriesterin","2 Isis",null,2046,12,12,"Gehängter","3 Herrscherin","3 Horus"]
[1847,20,20,"Gericht","2 Hohepriesterin","2 Isis",null,1947,21,21,"Welt","3 Herrscherin","3 Horus",null,2047,13,13,"Tod","4 Herrscher","1 Osiris"]
[1848,21,21,"Welt","3 Herrscherin","3 Horus",null,1948,22,22,"Narr","4 Herrscher","1 Osiris",null,2048,14,14,"Mässigkeit","5 Hierophant","2 Isis"]
[1849,22,22,"Narr","4 Herrscher","1 Osiris",null,1949,23,5,"Hierophant","5 Hierophant","2 Isis",null,2049,15,15,"Teufel","6 Liebende","3 Horus"]
[1850,14,14,"Mässigkeit","5 Hierophant","2 Isis",null,1950,15,15,"Teufel","6 Liebende","3 Horus",null,2050,7,7,"Wagen","7 Wagen","1 Osiris"]
[1851,15,15,"Teufel","6 Liebende","3 Horus",null,1951,16,16,"Turm","7 Wagen","1 Osiris",null,2051,8,8,"Kraft","8 Kraft","2 Isis"]
[1852,16,16,"Turm","7 Wagen","1 Osiris",null,1952,17,17,"Stern","8 Kraft","2 Isis",null,2052,9,9,"Eremit","9 Eremit","3 Horus"]
[1853,17,17,"Stern","8 Kraft","2 Isis",null,1953,18,18,"Mond","9 Eremit","3 Horus",null,2053,10,10,"Rad","1 Magier","1 Osiris"]
[1854,18,18,"Mond","9 Eremit","3 Horus",null,1954,19,19,"Sonne","1 Magier","1 Osiris",null,2054,11,11,"Gerechtigkeit","2 Hohepriesterin","2 Isis"]
[1855,19,19,"Sonne","1 Magier","1 Osiris",null,1955,20,20,"Gericht","2 Hohepriesterin","2 Isis",null,2055,12,12,"Gehängter","3 Herrscherin","3 Horus"]
[1856,20,20,"Gericht","2 Hohepriesterin","2 Isis",null,1956,21,21,"Welt","3 Herrscherin","3 Horus",null,2056,13,13,"Tod","4 Herrscher","1 Osiris"]
[1857,21,21,"Welt","3 Herrscherin","3 Horus",null,1957,22,22,"Narr","4 Herrscher","1 Osiris",null,2057,14,14,"Mässigkeit","5 Hierophant","2 Isis"]
[1858,22,22,"Narr","4 Herrscher","1 Osiris",null,1958,23,5,"Hierophant","5 Hierophant","2 Isis",null,2058,15,15,"Teufel","6 Liebende","3 Horus"]
[1859,23,5,"Hierophant","5 Hierophant","2 Isis",null,1959,24,6,"Liebende","6 Liebende","3 Horus",null,2059,16,16,"Turm","7 Wagen","1 Osiris"]
[1860,15,15,"Teufel","6 Liebende","3 Horus",null,1960,16,16,"Turm","7 Wagen","1 Osiris",null,2060,8,8,"Kraft","8 Kraft","2 Isis"]
[1861,16,16,"Turm","7 Wagen","1 Osiris",null,1961,17,17,"Stern","8 Kraft","2 Isis",null,2061,9,9,"Eremit","9 Eremit","3 Horus"]
[1862,17,17,"Stern","8 Kraft","2 Isis",null,1962,18,18,"Mond","9 Eremit","3 Horus",null,2062,10,10,"Rad","1 Magier","1 Osiris"]
[1863,18,18,"Mond","9 Eremit","3 Horus",null,1963,19,19,"Sonne","1 Magier","1 Osiris",null,2063,11,11,"Gerechtigkeit","2 Hohepriesterin","2 Isis"]
[1864,19,19,"Sonne","1 Magier","1 Osiris",null,1964,20,20,"Gericht","2 Hohepriesterin","2 Isis",null,2064,12,12,"Gehängter","3 Herrscherin","3 Horus"]
[1865,{"$f":"SUMPRODUCT(MID(A71,ROW(INDIRECT(\"1:\"&LEN(A71))),1)*1)","v":20},{"$f":"IF(B71>22,SUMPRODUCT(VALUE(MID(B71,ROW(INDIRECT(\"$b1:$A\"&LEN(B71))),1))),B71)","v":20},{"$f":"VLOOKUP(C71,$A$111:$D$132,2,FALSE)","v":"Gericht"},{"$f":"VLOOKUP(C71,$A$111:$D$132,3,FALSE)","v":"2 Hohepriesterin"},{"$f":"VLOOKUP(C71,$A$111:$D$132,4,FALSE)","v":"2 Isis"},null,1965,{"$f":"SUMPRODUCT(MID(H71,ROW(INDIRECT(\"1:\"&LEN(H71))),1)*1)","v":21},{"$f":"IF(I71>22,SUMPRODUCT(VALUE(MID(I71,ROW(INDIRECT(\"$b1:$A\"&LEN(I71))),1))),I71)","v":21},{"$f":"VLOOKUP(J71,$A$111:$D$132,2,FALSE)","v":"Welt"},{"$f":"VLOOKUP(J71,$A$111:$D$132,3,FALSE)","v":"3 Herrscherin"},{"$f":"VLOOKUP(J71,$A$111:$D$132,4,FALSE)","v":"3 Horus"},null,2065,{"$f":"SUMPRODUCT(MID(O71,ROW(INDIRECT(\"1:\"&LEN(O71))),1)*1)","v":13},{"$f":"IF(P71>22,SUMPRODUCT(VALUE(MID(P71,ROW(INDIRECT(\"$b1:$A\"&LEN(P71))),1))),P71)","v":13},{"$f":"VLOOKUP(Q71,$A$111:$D$132,2,FALSE)","v":"Tod"},{"$f":"VLOOKUP(Q71,$A$111:$D$132,3,FALSE)","v":"4 Herrscher"},{"$f":"VLOOKUP(Q71,$A$111:$D$132,4,FALSE)","v":"1 Osiris"}]
[1866,21,21,"Welt","3 Herrscherin","3 Horus",null,1966,22,22,"Narr","4 Herrscher","1 Osiris",null,2066,14,14,"Mässigkeit","5 Hierophant","2 Isis"]
[1867,22,22,"Narr","4 Herrscher","1 Osiris",null,1967,23,5,"Hierophant","5 Hierophant","2 Isis",null,2067,15,15,"Teufel","6 Liebende","3 Horus"]
[1868,23,5,"Hierophant","5 Hierophant","2 Isis",null,1968,24,6,"Liebende","6 Liebende","3 Horus",null,2068,16,16,"Turm","7 Wagen","1 Osiris"]
[1869,24,6,"Liebende","6 Liebende","3 Horus",null,1969,25,7,"Wagen","7 Wagen","1 Osiris",null,2069,17,17,"Stern","8 Kraft","2 Isis"]
[1870,16,16,"Turm","7 Wagen","1 Osiris",null,1970,17,17,"Stern","8 Kraft","2 Isis",null,2070,9,9,"Eremit","9 Eremit","3 Horus"]
[1871,17,17,"Stern","8 Kraft","2 Isis",null,1971,18,18,"Mond","9 Eremit","3 Horus",null,2071,10,10,"Rad","1 Magier","1 Osiris"]
[1872,18,18,"Mond","9 Eremit","3 Horus",null,1972,19,19,"Sonne","1 Magier","1 Osiris",null,2072,11,11,"Gerechtigkeit","2 Hohepriesterin","2 Isis"]
[1873,19,19,"Sonne","1 Magier","1 Osiris",null,1973,20,20,"Gericht","2 Hohepriesterin","2 Isis",null,2073,12,12,"Gehängter","3 Herrscherin","3 Horus"]
[1874,20,20,"Gericht","2 Hohepriesterin","2 Isis",null,1974,21,21,"Welt","3 Herrscherin","3 Horus",null,2074,13,13,"Tod","4 Herrscher","1 Osiris"]
[1875,21,21,"Welt","3 Herrscherin","3 Horus",null,1975,22,22,"Narr","4 Herrscher","1 Osiris",null,2075,14,14,"Mässigkeit","5 Hierophant","2 Isis"]
[1876,22,22,"Narr","4 Herrscher","1 Osiris",null,1976,23,5,"Hierophant","5 Hierophant","2 Isis",null,2076,15,15,"Teufel","6 Liebende","3 Horus"]
[1877,23,5,"Hierophant","5 Hierophant","2 Isis",null,1977,24,6,"Liebende","6 Liebende","3 Horus",null,2077,16,16,"Turm","7 Wagen","1 Osiris"]
[1878,24,6,"Liebende","6 Liebende","3 Horus",null,1978,25,7,"Wagen","7 Wagen","1 Osiris",null,2078,17,17,"Stern","8 Kraft","2 Isis"]
[1879,25,7,"Wagen","7 Wagen","1 Osiris",null,1979,26,8,"Kraft","8 Kraft","2 Isis",null,2079,18,18,"Mond","9 Eremit","3 Horus"]
[1880,17,17,"Stern","8 Kraft","2 Isis",null,1980,18,18,"Mond","9 Eremit","3 Horus",null,2080,10,10,"Rad","1 Magier","1 Osiris"]
[1881,18,18,"Mond","9 Eremit","3 Horus",null,1981,19,19,"Sonne","1 Magier","1 Osiris",null,2081,11,11,"Gerechtigkeit","2 Hohepriesterin","2 Isis"]
[1882,19,19,"Sonne","1 Magier","1 Osiris",null,1982,20,20,"Gericht","2 Hohepriesterin","2 Isis",null,2082,12,12,"Gehängter","3 Herrscherin","3 Horus"]
[1883,20,20,"Gericht","2 Hohepriesterin","2 Isis",null,1983,21,21,"Welt","3 Herrscherin","3 Horus",null,2083,13,13,"Tod","4 Herrscher","1 Osiris"]
[1884,21,21,"Welt","3 Herrscherin","3 Horus",null,1984,22,22,"Narr","4 Herrscher","1 Osiris",null,2084,14,14,"Mässigkeit","5 Hierophant","2 Isis"]
[1885,22,22,"Narr","4 Herrscher","1 Osiris",null,1985,23,5,"Hierophant","5 Hierophant","2 Isis",null,2085,15,15,"Teufel","6 Liebende","3 Horus"]
[1886,23,5,"Hierophant","5 Hierophant","2 Isis",null,1986,24,6,"Liebende","6 Liebende","3 Horus",null,2086,16,16,"Turm","7 Wagen","1 Osiris"]
[1887,24,6,"Liebende","6 Liebende","3 Horus",null,1987,25,7,"Wagen","7 Wagen","1 Osiris",null,2087,17,17,"Stern","8 Kraft","2 Isis"]
[1888,25,7,"Wagen","7 Wagen","1 Osiris",null,1988,26,8,"Kraft","8 Kraft","2 Isis",null,2088,18,18,"Mond","9 Eremit","3 Horus"]
[1889,26,8,"Kraft","8 Kraft","2 Isis",null,1989,27,9,"Eremit","9 Eremit","3 Horus",null,2089,19,19,"Sonne","1 Magier","1 Osiris"]
[1890,18,18,"Mond","9 Eremit","3 Horus",null,1990,19,19,"Sonne","1 Magier","1 Osiris",null,2090,11,11,"Gerechtigkeit","2 Hohepriesterin","2 Isis"]
[1891,19,19,"Sonne","1 Magier","1 Osiris",null,1991,20,20,"Gericht","2 Hohepriesterin","2 Isis",null,2091,12,12,"Gehängter","3 Herrscherin","3 Horus"]
[1892,20,20,"Gericht","2 Hohepriesterin","2 Isis",null,1992,21,21,"Welt","3 Herrscherin","3 Horus",null,2092,13,13,"Tod","4 Herrscher","1 Osiris"]
[1893,21,21,"Welt","3 Herrscherin","3 Horus",null,1993,22,22,"Narr","4 Herrscher","1 Osiris",null,2093,14,14,"Mässigkeit","5 Hierophant","2 Isis"]
[1894,22,22,"Narr","4 Herrscher","1 Osiris",null,1994,23,5,"Hierophant","5 Hierophant","2 Isis",null,2094,15,15,"Teufel","6 Liebende","3 Horus"]
[1895,23,5,"Hierophant","5 Hierophant","2 Isis",null,1995,24,6,"Liebende","6 Liebende","3 Horus",null,2095,16,16,"Turm","7 Wagen","1 Osiris"]
[1896,24,6,"Liebende","6 Liebende","3 Horus",null,1996,25,7,"Wagen","7 Wagen","1 Osiris",null,2096,17,17,"Stern","8 Kraft","2 Isis"]
[1897,25,7,"Wagen","7 Wagen","1 Osiris",null,1997,26,8,"Kraft","8 Kraft","2 Isis",null,2097,18,18,"Mond","9 Eremit","3 Horus"]
[1898,26,8,"Kraft","8 Kraft","2 Isis",null,1998,27,9,"Eremit","9 Eremit","3 Horus",null,2098,19,19,"Sonne","1 Magier","1 Osiris"]
[1899,27,9,"Eremit","9 Eremit","3 Horus",null,1999,28,10,"Rad","1 Magier","1 Osiris",null,2099,20,20,"Gericht","2 Hohepriesterin","2 Isis"]
[]
[]
[]
[]
[]
[1,"Magier","1 Magier","1 Osiris"]
[2,"Hohepriesterin","2 Hohepriesterin","2 Isis"]
[3,"Herrscherin","3 Herrscherin","3 Horus"]
[4,"Herrscher","4 Herrscher","1 Osiris"]
[5,"Hierophant","5 Hierophant","2 Isis"]
[6,"Liebende","6 Liebende","3 Horus"]
[7,"Wagen","7 Wagen","1 Osiris"]
[8,"Kraft","8 Kraft","2 Isis"]
[9,"Eremit","9 Eremit","3 Horus"]
[10,"Rad","1 Magier","1 Osiris"]
[11,"Gerechtigkeit","2 Hohepriesterin","2 Isis"]
[12,"Gehängter","3 Herrscherin","3 Horus"]
[13,"Tod","4 Herrscher","1 Osiris"]
[14,"Mässigkeit","5 Hierophant","2 Isis"]
[15,"Teufel","6 Liebende","3 Horus"]
[16,"Turm","7 Wagen","1 Osiris"]
[17,"Stern","8 Kraft","2 Isis"]
[18,"Mond","9 Eremit","3 Horus"]
[19,"Sonne","1 Magier","1 Osiris"]
[20,"Gericht","2 Hohepriesterin","2 Isis"]
[21,"Welt","3 Herrscherin","3 Horus"]
[22,"Narr","4 Herrscher","1 Osiris"]

{"sheet":"Namensanalyse","index":4,"n_rows":79,"n_cols":124,"rows_kept":79,"cut":false,"hidden":true,"merged":[]}
["Die Berechnungen der Namensanalyse","für",{"$f":"Jahreskarten!E8","v":"Zum "},{"$f":"Jahreskarten!F8","v":"Beispiel"}]
["Bitte denken Sie daran, dass der Buchstabe \"Y\" ein Vokal oder ein Konsonant sein kann. In Xylophon oder Mary ist es ein Vokal. Er wird als ü oder i gesprochen."]
["In Yoga, Beyoncé oder Yak ist es ein Konsonant. Dann wird das Y als J gesprochen. Wenn das Y im Namen ein Vokal ist, schreiben Sie es wie gewohnt als y. "]
["Wenn das Y aber ein Konsonant ist, dann tragen Sie im Namen \"yj\" ein. So kann das Programm erkennen, ob es sich um einen Vokal oder einen Konsonanten handelt. "]
["Schreiben Sie das scharfe S (β) immer als doppeltes S. Statt Straβe schreiben Sie also Strasse. Französische Akzente wie é, è oder ë lassen Sie weg, genauso wie die Tilde bei ñ. Sie verändern den Buchstabenwert nicht."]
[null,"Jahr","Monat","Tag"]
["Geben Sie auf dem Blatt \"Jahreskarten\" Ihr Geburtsdatum ein:",{"$f":"Jahreskarten!A8","v":1962},{"$f":"Jahreskarten!B8","v":7},{"$f":"Jahreskarten!C8","v":12}]
["Vorname","a","n","d","r","e",0,0]
[null,{"$f":"IF(B8=\"a\",1,IF(B8=\"b\",2,IF(B8=\"c\",3,IF(B8=\"d\",4,IF(B8=\"e\",5,IF(B8=\"f\",6,IF(B8=\"g\",7,IF(B8=\"h\",8,IF(B8=\"i\",9,IF(B8=\"j\",10,IF(B8=\"k\",11,IF(B8=\"l\",12,IF(B8=\"m\",13,IF(B8=\"n\",14,IF(B8=\"o\",15,IF(B8=\"p\",16,IF(B8=\"q\",17,IF(B8=\"r\",18,IF(B8=\"s\",19,IF(B8=\"t\",20,IF(B8=\"u\",21,IF(B8=\"v\",22,IF(B8=\"w\",23,IF(B8=\"x\",24,IF(B8=\"y\",25,IF(B8=\"yj\",25,IF(B8=\"z\",26,0)))))))))))))))))))))))))))","v":1},{"$f":"IF(C8=\"a\",1,IF(C8=\"b\",2,IF(C8=\"c\",3,IF(C8=\"d\",4,IF(C8=\"e\",5,IF(C8=\"f\",6,IF(C8=\"g\",7,IF(C8=\"h\",8,IF(C8=\"i\",9,IF(C8=\"j\",10,IF(C8=\"k\",11,IF(C8=\"l\",12,IF(C8=\"m\",13,IF(C8=\"n\",14,IF(C8=\"o\",15,IF(C8=\"p\",16,IF(C8=\"q\",17,IF(C8=\"r\",18,IF(C8=\"s\",19,IF(C8=\"t\",20,IF(C8=\"u\",21,IF(C8=\"v\",22,IF(C8=\"w\",23,IF(C8=\"x\",24,IF(C8=\"y\",25,IF(C8=\"yj\",25,IF(C8=\"z\",26,0)))))))))))))))))))))))))))","v":14},{"$f":"IF(D8=\"a\",1,IF(D8=\"b\",2,IF(D8=\"c\",3,IF(D8=\"d\",4,IF(D8=\"e\",5,IF(D8=\"f\",6,IF(D8=\"g\",7,IF(D8=\"h\",8,IF(D8=\"i\",9,IF(D8=\"j\",10,IF(D8=\"k\",11,IF(D8=\"l\",12,IF(D8=\"m\",13,IF(D8=\"n\",14,IF(D8=\"o\",15,IF(D8=\"p\",16,IF(D8=\"q\",17,IF(D8=\"r\",18,IF(D8=\"s\",19,IF(D8=\"t\",20,IF(D8=\"u\",21,IF(D8=\"v\",22,IF(D8=\"w\",23,IF(D8=\"x\",24,IF(D8=\"y\",25,IF(D8=\"yj\",25,IF(D8=\"z\",26,0)))))))))))))))))))))))))))","v":4},{"$f":"IF(E8=\"a\",1,IF(E8=\"b\",2,IF(E8=\"c\",3,IF(E8=\"d\",4,IF(E8=\"e\",5,IF(E8=\"f\",6,IF(E8=\"g\",7,IF(E8=\"h\",8,IF(E8=\"i\",9,IF(E8=\"j\",10,IF(E8=\"k\",11,IF(E8=\"l\",12,IF(E8=\"m\",13,IF(E8=\"n\",14,IF(E8=\"o\",15,IF(E8=\"p\",16,IF(E8=\"q\",17,IF(E8=\"r\",18,IF(E8=\"s\",19,IF(E8=\"t\",20,IF(E8=\"u\",21,IF(E8=\"v\",22,IF(E8=\"w\",23,IF(E8=\"x\",24,IF(E8=\"y\",25,IF(E8=\"yj\",25,IF(E8=\"z\",26,0)))))))))))))))))))))))))))","v":18},{"$f":"IF(F8=\"a\",1,IF(F8=\"b\",2,IF(F8=\"c\",3,IF(F8=\"d\",4,IF(F8=\"e\",5,IF(F8=\"f\",6,IF(F8=\"g\",7,IF(F8=\"h\",8,IF(F8=\"i\",9,IF(F8=\"j\",10,IF(F8=\"k\",11,IF(F8=\"l\",12,IF(F8=\"m\",13,IF(F8=\"n\",14,IF(F8=\"o\",15,IF(F8=\"p\",16,IF(F8=\"q\",17,IF(F8=\"r\",18,IF(F8=\"s\",19,IF(F8=\"t\",20,IF(F8=\"u\",21,IF(F8=\"v\",22,IF(F8=\"w\",23,IF(F8=\"x\",24,IF(F8=\"y\",25,IF(F8=\"yj\",25,IF(F8=\"z\",26,0)))))))))))))))))))))))))))","v":5},{"$f":"IF(G8=\"a\",1,IF(G8=\"b\",2,IF(G8=\"c\",3,IF(G8=\"d\",4,IF(G8=\"e\",5,IF(G8=\"f\",6,IF(G8=\"g\",7,IF(G8=\"h\",8,IF(G8=\"i\",9,IF(G8=\"j\",10,IF(G8=\"k\",11,IF(G8=\"l\",12,IF(G8=\"m\",13,IF(G8=\"n\",14,IF(G8=\"o\",15,IF(G8=\"p\",16,IF(G8=\"q\",17,IF(G8=\"r\",18,IF(G8=\"s\",19,IF(G8=\"t\",20,IF(G8=\"u\",21,IF(G8=\"v\",22,IF(G8=\"w\",23,IF(G8=\"x\",24,IF(G8=\"y\",25,IF(G8=\"yj\",25,IF(G8=\"z\",26,0)))))))))))))))))))))))))))","v":0},0,0,0,0,0,0,0,0,0,0,0,0,{"$f":"SUM(B9:S9)","v":42},{"$f":"IF(T9>22,SUMPRODUCT(VALUE(MID(T9,ROW(INDIRECT(\"$b1:$A\"&LEN(T9))),1))),T9)","v":6},null,null,null,null,{"$f":"B9","v":1},{"$f":"C9","v":14},{"$f":"D9","v":4},18,5,0,0,0,0,0,0,0,0,0,0,0,0,0,{"$f":"B11","v":16},{"$f":"C11","v":9},{"$f":"D11","v":5},18,18,5,0,0,0,0,0,0,0,0,0,0,0,0,{"$f":"B13","v":0},{"$f":"C13","v":0},0,0,0,0,0,0,0,0,0,0,0,0,0,0,{"$f":"R13","v":0},{"$f":"S13","v":0},{"$f":"B15","v":0},{"$f":"C15","v":0},0,0,0,0,0,0,0,0,0,0,0,0,{"$f":"P15","v":0},{"$f":"Q15","v":0},{"$f":"R15","v":0},{"$f":"S15","v":0},{"$f":"B17","v":16},{"$f":"C17","v":1},19,20,5,21,18,0,0,0,0,0,0,0,0,0,0,0]
["Mittlerer Name 1","p","i","e","r","r","e",0,0,null,null,null,null,null,null,null,null,null,null,null,null,null,null,null,null,{"$f":"IF(Z9>22,SUMPRODUCT(VALUE(MID(Z9,ROW(INDIRECT(\"$b1:$A\"&LEN(Z9))),1))),Z9)","v":1},{"$f":"IF(AA9>22,SUMPRODUCT(VALUE(MID(AA9,ROW(INDIRECT(\"$b1:$A\"&LEN(AA9))),1))),AA9)","v":14},4,18,5,0,0,0,0,0,0,0,0,0,0,0,0,0,16,9,5,18,18,5,0,0,0,0,0,0,0,0,0,0,0,0,0,0,0,0,0,0,0,0,0,0,0,0,0,0,0,0,0,0,0,0,0,0,0,0,0,0,0,0,0,{"$f":"IF(CM9>22,SUMPRODUCT(VALUE(MID(CM9,ROW(INDIRECT(\"$b1:$A\"&LEN(CM9))),1))),CM9)","v":0},0,0,0,0,0,0,16,1,19,20,5,21,18,0,0,0,0,0,0,0,0,0,0,0,{"$f":"U25","v":7},{"$f":"U33","v":8},{"$f":"U9","v":6},{"$f":"U11","v":8},{"$f":"U13","v":0},{"$f":"U15","v":0},{"$f":"U17","v":1},{"$f":"U18","v":6},{"$f":"AC13","v":213}]
[null,{"$f":"IF(B10=\"a\",1,IF(B10=\"b\",2,IF(B10=\"c\",3,IF(B10=\"d\",4,IF(B10=\"e\",5,IF(B10=\"f\",6,IF(B10=\"g\",7,IF(B10=\"h\",8,IF(B10=\"i\",9,IF(B10=\"j\",10,IF(B10=\"k\",11,IF(B10=\"l\",12,IF(B10=\"m\",13,IF(B10=\"n\",14,IF(B10=\"o\",15,IF(B10=\"p\",16,IF(B10=\"q\",17,IF(B10=\"r\",18,IF(B10=\"s\",19,IF(B10=\"t\",20,IF(B10=\"u\",21,IF(B10=\"v\",22,IF(B10=\"w\",23,IF(B10=\"x\",24,IF(B10=\"y\",25,IF(B10=\"yj\",25,IF(B10=\"z\",26,0)))))))))))))))))))))))))))","v":16},{"$f":"IF(C10=\"a\",1,IF(C10=\"b\",2,IF(C10=\"c\",3,IF(C10=\"d\",4,IF(C10=\"e\",5,IF(C10=\"f\",6,IF(C10=\"g\",7,IF(C10=\"h\",8,IF(C10=\"i\",9,IF(C10=\"j\",10,IF(C10=\"k\",11,IF(C10=\"l\",12,IF(C10=\"m\",13,IF(C10=\"n\",14,IF(C10=\"o\",15,IF(C10=\"p\",16,IF(C10=\"q\",17,IF(C10=\"r\",18,IF(C10=\"s\",19,IF(C10=\"t\",20,IF(C10=\"u\",21,IF(C10=\"v\",22,IF(C10=\"w\",23,IF(C10=\"x\",24,IF(C10=\"y\",25,IF(C10=\"yj\",25,IF(C10=\"z\",26,0)))))))))))))))))))))))))))","v":9},{"$f":"IF(D10=\"a\",1,IF(D10=\"b\",2,IF(D10=\"c\",3,IF(D10=\"d\",4,IF(D10=\"e\",5,IF(D10=\"f\",6,IF(D10=\"g\",7,IF(D10=\"h\",8,IF(D10=\"i\",9,IF(D10=\"j\",10,IF(D10=\"k\",11,IF(D10=\"l\",12,IF(D10=\"m\",13,IF(D10=\"n\",14,IF(D10=\"o\",15,IF(D10=\"p\",16,IF(D10=\"q\",17,IF(D10=\"r\",18,IF(D10=\"s\",19,IF(D10=\"t\",20,IF(D10=\"u\",21,IF(D10=\"v\",22,IF(D10=\"w\",23,IF(D10=\"x\",24,IF(D10=\"y\",25,IF(D10=\"yj\",25,IF(D10=\"z\",26,0)))))))))))))))))))))))))))","v":5},18,18,5,0,0,0,0,0,0,0,0,0,0,0,0,{"$f":"SUM(B11:S11)","v":71},{"$f":"IF(T11>22,SUMPRODUCT(VALUE(MID(T11,ROW(INDIRECT(\"$b1:$A\"&LEN(T11))),1))),T11)","v":8}]
["Mittlerer Name 2",0,0,0,0,0,0]
[null,{"$f":"IF(B12=\"a\",1,IF(B12=\"b\",2,IF(B12=\"c\",3,IF(B12=\"d\",4,IF(B12=\"e\",5,IF(B12=\"f\",6,IF(B12=\"g\",7,IF(B12=\"h\",8,IF(B12=\"i\",9,IF(B12=\"j\",10,IF(B12=\"k\",11,IF(B12=\"l\",12,IF(B12=\"m\",13,IF(B12=\"n\",14,IF(B12=\"o\",15,IF(B12=\"p\",16,IF(B12=\"q\",17,IF(B12=\"r\",18,IF(B12=\"s\",19,IF(B12=\"t\",20,IF(B12=\"u\",21,IF(B12=\"v\",22,IF(B12=\"w\",23,IF(B12=\"x\",24,IF(B12=\"y\",25,IF(B12=\"yj\",25,IF(B12=\"z\",26,0)))))))))))))))))))))))))))","v":0},{"$f":"IF(C12=\"a\",1,IF(C12=\"b\",2,IF(C12=\"c\",3,IF(C12=\"d\",4,IF(C12=\"e\",5,IF(C12=\"f\",6,IF(C12=\"g\",7,IF(C12=\"h\",8,IF(C12=\"i\",9,IF(C12=\"j\",10,IF(C12=\"k\",11,IF(C12=\"l\",12,IF(C12=\"m\",13,IF(C12=\"n\",14,IF(C12=\"o\",15,IF(C12=\"p\",16,IF(C12=\"q\",17,IF(C12=\"r\",18,IF(C12=\"s\",19,IF(C12=\"t\",20,IF(C12=\"u\",21,IF(C12=\"v\",22,IF(C12=\"w\",23,IF(C12=\"x\",24,IF(C12=\"y\",25,IF(C12=\"yj\",25,IF(C12=\"z\",26,0)))))))))))))))))))))))))))","v":0},0,0,0,0,0,0,0,0,0,0,0,0,0,0,0,0,{"$f":"SUM(B13:S13)","v":0},{"$f":"IF(T13>22,SUMPRODUCT(VALUE(MID(T13,ROW(INDIRECT(\"$b1:$A\"&LEN(T13))),1))),T13)","v":0},null,null,null,null,{"$f":"B7","v":1962},{"$f":"C7","v":7},{"$f":"D7","v":12},{"$f":"T18","v":213},{"$f":"SUM(Z13:AC13)","v":2194},{"$f":"IF(AD13>22,SUMPRODUCT(VALUE(MID(AD13,ROW(INDIRECT(\"$b1:$A\"&LEN(AD13))),1))),AD13)","v":16},{"$f":"IF(AE13>22,SUMPRODUCT(VALUE(MID(AE13,ROW(INDIRECT(\"$b1:$A\"&LEN(AE13))),1))),AE13)","v":16}]
["Mittlerer Name 3",0,0,0,0,0,0,null,null,null,null,null,null,null,null,null,null,null,null,null,null,null,null,null,null,null,null,null,null,{"$f":"SUM(Z13+AA13+AB13)","v":1981},{"$f":"IF(AD14>22,SUMPRODUCT(VALUE(MID(AD14,ROW(INDIRECT(\"$b1:$A\"&LEN(AD14))),1))),AD14)","v":19},{"$f":"IF(AE14>22,SUMPRODUCT(VALUE(MID(AE14,ROW(INDIRECT(\"$b1:$A\"&LEN(AE14))),1))),AE14)","v":19}]
[null,{"$f":"IF(B14=\"a\",1,IF(B14=\"b\",2,IF(B14=\"c\",3,IF(B14=\"d\",4,IF(B14=\"e\",5,IF(B14=\"f\",6,IF(B14=\"g\",7,IF(B14=\"h\",8,IF(B14=\"i\",9,IF(B14=\"j\",10,IF(B14=\"k\",11,IF(B14=\"l\",12,IF(B14=\"m\",13,IF(B14=\"n\",14,IF(B14=\"o\",15,IF(B14=\"p\",16,IF(B14=\"q\",17,IF(B14=\"r\",18,IF(B14=\"s\",19,IF(B14=\"t\",20,IF(B14=\"u\",21,IF(B14=\"v\",22,IF(B14=\"w\",23,IF(B14=\"x\",24,IF(B14=\"y\",25,IF(B14=\"yj\",25,IF(B14=\"z\",26,0)))))))))))))))))))))))))))","v":0},{"$f":"IF(C14=\"a\",1,IF(C14=\"b\",2,IF(C14=\"c\",3,IF(C14=\"d\",4,IF(C14=\"e\",5,IF(C14=\"f\",6,IF(C14=\"g\",7,IF(C14=\"h\",8,IF(C14=\"i\",9,IF(C14=\"j\",10,IF(C14=\"k\",11,IF(C14=\"l\",12,IF(C14=\"m\",13,IF(C14=\"n\",14,IF(C14=\"o\",15,IF(C14=\"p\",16,IF(C14=\"q\",17,IF(C14=\"r\",18,IF(C14=\"s\",19,IF(C14=\"t\",20,IF(C14=\"u\",21,IF(C14=\"v\",22,IF(C14=\"w\",23,IF(C14=\"x\",24,IF(C14=\"y\",25,IF(C14=\"yj\",25,IF(C14=\"z\",26,0)))))))))))))))))))))))))))","v":0},0,0,0,0,0,0,0,0,0,0,0,0,0,0,0,0,{"$f":"SUM(B15:S15)","v":0},{"$f":"IF(T15>22,SUMPRODUCT(VALUE(MID(T15,ROW(INDIRECT(\"$b1:$A\"&LEN(T15))),1))),T15)","v":0}]
["Nachname","p","a","s","t","e","u","r",0]
[null,{"$f":"IF(B16=\"a\",1,IF(B16=\"b\",2,IF(B16=\"c\",3,IF(B16=\"d\",4,IF(B16=\"e\",5,IF(B16=\"f\",6,IF(B16=\"g\",7,IF(B16=\"h\",8,IF(B16=\"i\",9,IF(B16=\"j\",10,IF(B16=\"k\",11,IF(B16=\"l\",12,IF(B16=\"m\",13,IF(B16=\"n\",14,IF(B16=\"o\",15,IF(B16=\"p\",16,IF(B16=\"q\",17,IF(B16=\"r\",18,IF(B16=\"s\",19,IF(B16=\"t\",20,IF(B16=\"u\",21,IF(B16=\"v\",22,IF(B16=\"w\",23,IF(B16=\"x\",24,IF(B16=\"y\",25,IF(B16=\"yj\",25,IF(B16=\"z\",26,0)))))))))))))))))))))))))))","v":16},{"$f":"IF(C16=\"a\",1,IF(C16=\"b\",2,IF(C16=\"c\",3,IF(C16=\"d\",4,IF(C16=\"e\",5,IF(C16=\"f\",6,IF(C16=\"g\",7,IF(C16=\"h\",8,IF(C16=\"i\",9,IF(C16=\"j\",10,IF(C16=\"k\",11,IF(C16=\"l\",12,IF(C16=\"m\",13,IF(C16=\"n\",14,IF(C16=\"o\",15,IF(C16=\"p\",16,IF(C16=\"q\",17,IF(C16=\"r\",18,IF(C16=\"s\",19,IF(C16=\"t\",20,IF(C16=\"u\",21,IF(C16=\"v\",22,IF(C16=\"w\",23,IF(C16=\"x\",24,IF(C16=\"y\",25,IF(C16=\"yj\",25,IF(C16=\"z\",26,0)))))))))))))))))))))))))))","v":1},{"$f":"IF(D16=\"a\",1,IF(D16=\"b\",2,IF(D16=\"c\",3,IF(D16=\"d\",4,IF(D16=\"e\",5,IF(D16=\"f\",6,IF(D16=\"g\",7,IF(D16=\"h\",8,IF(D16=\"i\",9,IF(D16=\"j\",10,IF(D16=\"k\",11,IF(D16=\"l\",12,IF(D16=\"m\",13,IF(D16=\"n\",14,IF(D16=\"o\",15,IF(D16=\"p\",16,IF(D16=\"q\",17,IF(D16=\"r\",18,IF(D16=\"s\",19,IF(D16=\"t\",20,IF(D16=\"u\",21,IF(D16=\"v\",22,IF(D16=\"w\",23,IF(D16=\"x\",24,IF(D16=\"y\",25,IF(D16=\"yj\",25,IF(D16=\"z\",26,0)))))))))))))))))))))))))))","v":19},20,5,21,18,0,0,0,0,0,0,0,0,0,0,0,{"$f":"SUM(B17:S17)","v":100},{"$f":"IF(T17>22,SUMPRODUCT(VALUE(MID(T17,ROW(INDIRECT(\"$b1:$A\"&LEN(T17))),1))),T17)","v":1}]
["Summe aller Namen",null,null,null,null,null,null,null,null,null,null,null,null,null,null,null,null,null,null,{"$f":"SUM(T9:T17)","v":213},{"$f":"IF(T18>22,SUMPRODUCT(VALUE(MID(T18,ROW(INDIRECT(\"$b1:$A\"&LEN(T18))),1))),T18)","v":6}]
[]
["Die Vokale des Vornamens",{"$f":"IF(B8=\"a\",1,IF(B8=\"e\",5,IF(B8=\"i\",9,IF(B8=\"o\",15,IF(B8=\"u\",21,IF(B8=\"y\",25,IF(B8=\"ä\",1,IF(B8=\"ö\",15,IF(B8=\"ü\",21,0)))))))))","v":1},{"$f":"IF(C8=\"a\",1,IF(C8=\"e\",5,IF(C8=\"i\",9,IF(C8=\"o\",15,IF(C8=\"u\",21,IF(C8=\"y\",25,IF(C8=\"ä\",1,IF(C8=\"ö\",15,IF(C8=\"ü\",21,0)))))))))","v":0},0,0,5,0,0,0,0,0,0,0,0,0,0,0,0,0,{"$f":"SUM(B20:S20)","v":6}]
["Die Vokale des mittleren Namens 1",{"$f":"IF(B10=\"a\",1,IF(B10=\"e\",5,IF(B10=\"i\",9,IF(B10=\"o\",15,IF(B10=\"u\",21,IF(B10=\"y\",25,IF(B10=\"ä\",1,IF(B10=\"ö\",15,IF(B10=\"ü\",21,0)))))))))","v":0},{"$f":"IF(C10=\"a\",1,IF(C10=\"e\",5,IF(C10=\"i\",9,IF(C10=\"o\",15,IF(C10=\"u\",21,IF(C10=\"y\",25,IF(C10=\"ä\",1,IF(C10=\"ö\",15,IF(C10=\"ü\",21,0)))))))))","v":9},5,0,0,5,0,0,0,0,0,0,0,0,0,0,0,0,{"$f":"SUM(B21:S21)","v":19}]
["Die Vokale des mittleren Namens 2",{"$f":"IF(B12=\"a\",1,IF(B12=\"e\",5,IF(B12=\"i\",9,IF(B12=\"o\",15,IF(B12=\"u\",21,IF(B12=\"y\",25,IF(B12=\"ä\",1,IF(B12=\"ö\",15,IF(B12=\"ü\",21,0)))))))))","v":0},{"$f":"IF(C12=\"a\",1,IF(C12=\"e\",5,IF(C12=\"i\",9,IF(C12=\"o\",15,IF(C12=\"u\",21,IF(C12=\"y\",25,IF(C12=\"ä\",1,IF(C12=\"ö\",15,IF(C12=\"ü\",21,0)))))))))","v":0},0,0,0,0,0,0,0,0,0,0,0,0,0,0,0,0,{"$f":"SUM(B22:S22)","v":0}]
["Die Vokale des mittleren Namens 3",{"$f":"IF(B14=\"a\",1,IF(B14=\"e\",5,IF(B14=\"i\",9,IF(B14=\"o\",15,IF(B14=\"u\",21,IF(B14=\"y\",25,IF(B14=\"ä\",1,IF(B14=\"ö\",15,IF(B14=\"ü\",21,0)))))))))","v":0},{"$f":"IF(C14=\"a\",1,IF(C14=\"e\",5,IF(C14=\"i\",9,IF(C14=\"o\",15,IF(C14=\"u\",21,IF(C14=\"y\",25,IF(C14=\"ä\",1,IF(C14=\"ö\",15,IF(C14=\"ü\",21,0)))))))))","v":0},0,0,0,0,0,0,0,0,0,0,0,0,0,0,0,0,{"$f":"SUM(B23:S23)","v":0}]
["Die Vokale des Nachnamens",{"$f":"IF(B16=\"a\",1,IF(B16=\"e\",5,IF(B16=\"i\",9,IF(B16=\"o\",15,IF(B16=\"u\",21,IF(B16=\"y\",25,IF(B16=\"ä\",1,IF(B16=\"ö\",15,IF(B16=\"ü\",21,0)))))))))","v":0},{"$f":"IF(C16=\"a\",1,IF(C16=\"e\",5,IF(C16=\"i\",9,IF(C16=\"o\",15,IF(C16=\"u\",21,IF(C16=\"y\",25,IF(C16=\"ä\",1,IF(C16=\"ö\",15,IF(C16=\"ü\",21,0)))))))))","v":1},0,0,5,21,0,0,0,0,0,0,0,0,0,0,0,0,{"$f":"SUM(B23:S24)","v":27}]
["Summe aller Vokale",null,null,null,null,null,null,null,null,null,null,null,null,null,null,null,null,null,null,{"$f":"SUM(T20:T24)","v":52},{"$f":"IF(T25>22,SUMPRODUCT(VALUE(MID(T25,ROW(INDIRECT(\"$b1:$A\"&LEN(T25))),1))),T25)","v":7}]
[]
[]
["Die Konsonanten des Vornamens",{"$f":"IF(B8=\"a\",0,IF(B8=\"b\",2,IF(B8=\"c\",3,IF(B8=\"d\",4,IF(B8=\"e\",0,IF(B8=\"f\",6,IF(B8=\"g\",7,IF(B8=\"h\",8,IF(B8=\"i\",0,IF(B8=\"j\",10,IF(B8=\"k\",11,IF(B8=\"l\",12,IF(B8=\"m\",13,IF(B8=\"n\",14,IF(B8=\"o\",0,IF(B8=\"p\",16,IF(B8=\"q\",17,IF(B8=\"r\",18,IF(B8=\"s\",19,IF(B8=\"t\",20,IF(B8=\"u\",0,IF(B8=\"v\",22,IF(B8=\"w\",23,IF(B8=\"x\",24,IF(B8=\"y\",25,IF(B8=\"yj\",25,IF(B8=\"z\",26,0)))))))))))))))))))))))))))","v":0},{"$f":"IF(C8=\"a\",0,IF(C8=\"b\",2,IF(C8=\"c\",3,IF(C8=\"d\",4,IF(C8=\"e\",0,IF(C8=\"f\",6,IF(C8=\"g\",7,IF(C8=\"h\",8,IF(C8=\"i\",0,IF(C8=\"j\",10,IF(C8=\"k\",11,IF(C8=\"l\",12,IF(C8=\"m\",13,IF(C8=\"n\",14,IF(C8=\"o\",0,IF(C8=\"p\",16,IF(C8=\"q\",17,IF(C8=\"r\",18,IF(C8=\"s\",19,IF(C8=\"t\",20,IF(C8=\"u\",0,IF(C8=\"v\",22,IF(C8=\"w\",23,IF(C8=\"x\",24,IF(C8=\"y\",25,IF(C8=\"yj\",25,IF(C8=\"z\",26,0)))))))))))))))))))))))))))","v":14},{"$f":"IF(D8=\"a\",0,IF(D8=\"b\",2,IF(D8=\"c\",3,IF(D8=\"d\",4,IF(D8=\"e\",0,IF(D8=\"f\",6,IF(D8=\"g\",7,IF(D8=\"h\",8,IF(D8=\"i\",0,IF(D8=\"j\",10,IF(D8=\"k\",11,IF(D8=\"l\",12,IF(D8=\"m\",13,IF(D8=\"n\",14,IF(D8=\"o\",0,IF(D8=\"p\",16,IF(D8=\"q\",17,IF(D8=\"r\",18,IF(D8=\"s\",19,IF(D8=\"t\",20,IF(D8=\"u\",0,IF(D8=\"v\",22,IF(D8=\"w\",23,IF(D8=\"x\",24,IF(D8=\"y\",25,IF(D8=\"yj\",25,IF(D8=\"z\",26,0)))))))))))))))))))))))))))","v":4},18,0,0,0,0,0,0,0,0,0,0,0,0,0,0,{"$f":"SUM(B28:S28)","v":36}]
["Die Konsonanten des mittleren Namens 1",{"$f":"IF(B10=\"a\",0,IF(B10=\"b\",2,IF(B10=\"c\",3,IF(B10=\"d\",4,IF(B10=\"e\",0,IF(B10=\"f\",6,IF(B10=\"g\",7,IF(B10=\"h\",8,IF(B10=\"i\",0,IF(B10=\"j\",10,IF(B10=\"k\",11,IF(B10=\"l\",12,IF(B10=\"m\",13,IF(B10=\"n\",14,IF(B10=\"o\",0,IF(B10=\"p\",16,IF(B10=\"q\",17,IF(B10=\"r\",18,IF(B10=\"s\",19,IF(B10=\"t\",20,IF(B10=\"u\",0,IF(B10=\"v\",22,IF(B10=\"w\",23,IF(B10=\"x\",24,IF(B10=\"y\",25,IF(B10=\"yj\",25,IF(B10=\"z\",26,0)))))))))))))))))))))))))))","v":16},{"$f":"IF(C10=\"a\",0,IF(C10=\"b\",2,IF(C10=\"c\",3,IF(C10=\"d\",4,IF(C10=\"e\",0,IF(C10=\"f\",6,IF(C10=\"g\",7,IF(C10=\"h\",8,IF(C10=\"i\",0,IF(C10=\"j\",10,IF(C10=\"k\",11,IF(C10=\"l\",12,IF(C10=\"m\",13,IF(C10=\"n\",14,IF(C10=\"o\",0,IF(C10=\"p\",16,IF(C10=\"q\",17,IF(C10=\"r\",18,IF(C10=\"s\",19,IF(C10=\"t\",20,IF(C10=\"u\",0,IF(C10=\"v\",22,IF(C10=\"w\",23,IF(C10=\"x\",24,IF(C10=\"y\",25,IF(C10=\"yj\",25,IF(C10=\"z\",26,0)))))))))))))))))))))))))))","v":0},{"$f":"IF(D10=\"a\",0,IF(D10=\"b\",2,IF(D10=\"c\",3,IF(D10=\"d\",4,IF(D10=\"e\",0,IF(D10=\"f\",6,IF(D10=\"g\",7,IF(D10=\"h\",8,IF(D10=\"i\",0,IF(D10=\"j\",10,IF(D10=\"k\",11,IF(D10=\"l\",12,IF(D10=\"m\",13,IF(D10=\"n\",14,IF(D10=\"o\",0,IF(D10=\"p\",16,IF(D10=\"q\",17,IF(D10=\"r\",18,IF(D10=\"s\",19,IF(D10=\"t\",20,IF(D10=\"u\",0,IF(D10=\"v\",22,IF(D10=\"w\",23,IF(D10=\"x\",24,IF(D10=\"y\",0,IF(D10=\"yj\",25,IF(D10=\"z\",26,0)))))))))))))))))))))))))))","v":0},18,18,0,0,0,0,0,0,0,0,0,0,0,0,0,{"$f":"SUM(B29:S29)","v":52}]
["Die Konsonanten des mittleren Namens 2",{"$f":"IF(B12=\"a\",0,IF(B12=\"b\",2,IF(B12=\"c\",3,IF(B12=\"d\",4,IF(B12=\"e\",0,IF(B12=\"f\",6,IF(B12=\"g\",7,IF(B12=\"h\",8,IF(B12=\"i\",0,IF(B12=\"j\",10,IF(B12=\"k\",11,IF(B12=\"l\",12,IF(B12=\"m\",13,IF(B12=\"n\",14,IF(B12=\"o\",0,IF(B12=\"p\",16,IF(B12=\"q\",17,IF(B12=\"r\",18,IF(B12=\"s\",19,IF(B12=\"t\",20,IF(B12=\"u\",0,IF(B12=\"v\",22,IF(B12=\"w\",23,IF(B12=\"x\",24,IF(B12=\"y\",25,IF(B12=\"yj\",25,IF(B12=\"z\",26,0)))))))))))))))))))))))))))","v":0},{"$f":"IF(C12=\"a\",0,IF(C12=\"b\",2,IF(C12=\"c\",3,IF(C12=\"d\",4,IF(C12=\"e\",0,IF(C12=\"f\",6,IF(C12=\"g\",7,IF(C12=\"h\",8,IF(C12=\"i\",0,IF(C12=\"j\",10,IF(C12=\"k\",11,IF(C12=\"l\",12,IF(C12=\"m\",13,IF(C12=\"n\",14,IF(C12=\"o\",0,IF(C12=\"p\",16,IF(C12=\"q\",17,IF(C12=\"r\",18,IF(C12=\"s\",19,IF(C12=\"t\",20,IF(C12=\"u\",0,IF(C12=\"v\",22,IF(C12=\"w\",23,IF(C12=\"x\",24,IF(C12=\"y\",25,IF(C12=\"yj\",25,IF(C12=\"z\",26,0)))))))))))))))))))))))))))","v":0},{"$f":"IF(D12=\"a\",0,IF(D12=\"b\",2,IF(D12=\"c\",3,IF(D12=\"d\",4,IF(D12=\"e\",0,IF(D12=\"f\",6,IF(D12=\"g\",7,IF(D12=\"h\",8,IF(D12=\"i\",0,IF(D12=\"j\",10,IF(D12=\"k\",11,IF(D12=\"l\",12,IF(D12=\"m\",13,IF(D12=\"n\",14,IF(D12=\"o\",0,IF(D12=\"p\",16,IF(D12=\"q\",17,IF(D12=\"r\",18,IF(D12=\"s\",19,IF(D12=\"t\",20,IF(D12=\"u\",0,IF(D12=\"v\",22,IF(D12=\"w\",23,IF(D12=\"x\",24,IF(D12=\"y\",0,IF(D12=\"yj\",25,IF(D12=\"z\",26,0)))))))))))))))))))))))))))","v":0},0,0,0,0,0,0,0,0,0,0,0,0,0,0,{"$f":"IF(S12=\"a\",0,IF(S12=\"b\",2,IF(S12=\"c\",3,IF(S12=\"d\",4,IF(S12=\"e\",0,IF(S12=\"f\",6,IF(S12=\"g\",7,IF(S12=\"h\",8,IF(S12=\"i\",0,IF(S12=\"j\",10,IF(S12=\"k\",11,IF(S12=\"l\",12,IF(S12=\"m\",13,IF(S12=\"n\",14,IF(S12=\"o\",0,IF(S12=\"p\",16,IF(S12=\"q\",17,IF(S12=\"r\",18,IF(S12=\"s\",19,IF(S12=\"t\",20,IF(S12=\"u\",0,IF(S12=\"v\",22,IF(S12=\"w\",23,IF(S12=\"x\",24,IF(S12=\"y\",25,IF(S12=\"yj\",25,IF(S12=\"z\",26,0)))))))))))))))))))))))))))","v":0},{"$f":"SUM(B30:S30)","v":0}]
["Die Konsonanten des mittleren Namens 3",{"$f":"IF(B14=\"a\",0,IF(B14=\"b\",2,IF(B14=\"c\",3,IF(B14=\"d\",4,IF(B14=\"e\",0,IF(B14=\"f\",6,IF(B14=\"g\",7,IF(B14=\"h\",8,IF(B14=\"i\",0,IF(B14=\"j\",10,IF(B14=\"k\",11,IF(B14=\"l\",12,IF(B14=\"m\",13,IF(B14=\"n\",14,IF(B14=\"o\",0,IF(B14=\"p\",16,IF(B14=\"q\",17,IF(B14=\"r\",18,IF(B14=\"s\",19,IF(B14=\"t\",20,IF(B14=\"u\",0,IF(B14=\"v\",22,IF(B14=\"w\",23,IF(B14=\"x\",24,IF(B14=\"y\",25,IF(B14=\"yj\",25,IF(B14=\"z\",26,0)))))))))))))))))))))))))))","v":0},{"$f":"IF(C14=\"a\",0,IF(C14=\"b\",2,IF(C14=\"c\",3,IF(C14=\"d\",4,IF(C14=\"e\",0,IF(C14=\"f\",6,IF(C14=\"g\",7,IF(C14=\"h\",8,IF(C14=\"i\",0,IF(C14=\"j\",10,IF(C14=\"k\",11,IF(C14=\"l\",12,IF(C14=\"m\",13,IF(C14=\"n\",14,IF(C14=\"o\",0,IF(C14=\"p\",16,IF(C14=\"q\",17,IF(C14=\"r\",18,IF(C14=\"s\",19,IF(C14=\"t\",20,IF(C14=\"u\",0,IF(C14=\"v\",22,IF(C14=\"w\",23,IF(C14=\"x\",24,IF(C14=\"y\",25,IF(C14=\"yj\",25,IF(C14=\"z\",26,0)))))))))))))))))))))))))))","v":0},{"$f":"IF(D14=\"a\",0,IF(D14=\"b\",2,IF(D14=\"c\",3,IF(D14=\"d\",4,IF(D14=\"e\",0,IF(D14=\"f\",6,IF(D14=\"g\",7,IF(D14=\"h\",8,IF(D14=\"i\",0,IF(D14=\"j\",10,IF(D14=\"k\",11,IF(D14=\"l\",12,IF(D14=\"m\",13,IF(D14=\"n\",14,IF(D14=\"o\",0,IF(D14=\"p\",16,IF(D14=\"q\",17,IF(D14=\"r\",18,IF(D14=\"s\",19,IF(D14=\"t\",20,IF(D14=\"u\",0,IF(D14=\"v\",22,IF(D14=\"w\",23,IF(D14=\"x\",24,IF(D14=\"y\",0,IF(D14=\"yj\",25,IF(D14=\"z\",26,0)))))))))))))))))))))))))))","v":0},0,0,0,0,0,0,0,0,0,0,0,0,0,0,0,{"$f":"SUM(B31:S31)","v":0}]
["Die Konsonanten des Nachnamens",{"$f":"IF(B16=\"a\",0,IF(B16=\"b\",2,IF(B16=\"c\",3,IF(B16=\"d\",4,IF(B16=\"e\",0,IF(B16=\"f\",6,IF(B16=\"g\",7,IF(B16=\"h\",8,IF(B16=\"i\",0,IF(B16=\"j\",10,IF(B16=\"k\",11,IF(B16=\"l\",12,IF(B16=\"m\",13,IF(B16=\"n\",14,IF(B16=\"o\",0,IF(B16=\"p\",16,IF(B16=\"q\",17,IF(B16=\"r\",18,IF(B16=\"s\",19,IF(B16=\"t\",20,IF(B16=\"u\",0,IF(B16=\"v\",22,IF(B16=\"w\",23,IF(B16=\"x\",24,IF(B16=\"y\",25,IF(B16=\"yj\",25,IF(B16=\"z\",26,0)))))))))))))))))))))))))))","v":16},{"$f":"IF(C16=\"a\",0,IF(C16=\"b\",2,IF(C16=\"c\",3,IF(C16=\"d\",4,IF(C16=\"e\",0,IF(C16=\"f\",6,IF(C16=\"g\",7,IF(C16=\"h\",8,IF(C16=\"i\",0,IF(C16=\"j\",10,IF(C16=\"k\",11,IF(C16=\"l\",12,IF(C16=\"m\",13,IF(C16=\"n\",14,IF(C16=\"o\",0,IF(C16=\"p\",16,IF(C16=\"q\",17,IF(C16=\"r\",18,IF(C16=\"s\",19,IF(C16=\"t\",20,IF(C16=\"u\",0,IF(C16=\"v\",22,IF(C16=\"w\",23,IF(C16=\"x\",24,IF(C16=\"y\",25,IF(C16=\"yj\",25,IF(C16=\"z\",26,0)))))))))))))))))))))))))))","v":0},{"$f":"IF(D16=\"a\",0,IF(D16=\"b\",2,IF(D16=\"c\",3,IF(D16=\"d\",4,IF(D16=\"e\",0,IF(D16=\"f\",6,IF(D16=\"g\",7,IF(D16=\"h\",8,IF(D16=\"i\",0,IF(D16=\"j\",10,IF(D16=\"k\",11,IF(D16=\"l\",12,IF(D16=\"m\",13,IF(D16=\"n\",14,IF(D16=\"o\",0,IF(D16=\"p\",16,IF(D16=\"q\",17,IF(D16=\"r\",18,IF(D16=\"s\",19,IF(D16=\"t\",20,IF(D16=\"u\",0,IF(D16=\"v\",22,IF(D16=\"w\",23,IF(D16=\"x\",24,IF(D16=\"y\",0,IF(D16=\"yj\",25,IF(D16=\"z\",26,0)))))))))))))))))))))))))))","v":19},20,0,0,18,0,0,0,0,0,0,0,0,0,0,0,{"$f":"SUM(B32:S32)","v":73},null,"Kontrollsumme"]
["Summe aller Konsonanten",null,null,null,null,null,null,null,null,null,null,null,null,null,null,null,null,null,null,{"$f":"SUM(T28:T32)","v":161},{"$f":"IF(T33>22,SUMPRODUCT(VALUE(MID(T33,ROW(INDIRECT(\"$b1:$A\"&LEN(T33))),1))),T33)","v":8},{"$f":"SUM(T25+T33)","v":213}]
[]
[]
["Die Häufigkeit der Karten",null,"Konstellationen","Summe","Gruppen","Summe"]
["1 Der Magier",{"$f":"(COUNTIF($Z$10:$DK$10,1))","v":2},"1 Der Magier",{"$f":"SUM(B37+B46+B55)","v":3},"Osiris",{"$f":"SUM(B37+B40+B43+B46+B49+B52+B55+B58)","v":6}]
["2 Die Hohepriesterin",{"$f":"(COUNTIF($Z$10:$DK$10,2))","v":0},"2 Die Hohepriesterin",{"$f":"SUM(B38+B47+B56)","v":1},"Isis",{"$f":"SUM(B38+B41+B44+B47+B50+B53+B56)","v":6}]
["3 Die Herrscherin",{"$f":"(COUNTIF($Z$10:$DK$10,3))","v":0},"3 Die Herrscherin",{"$f":"SUM(B39+B48+B57)","v":1},"Horus",{"$f":"SUM(B39+B42+B45+B48+B51+B54+B57)","v":6}]
["4 Der Herrscher",{"$f":"(COUNTIF($Z$10:$DK$10,4))","v":1},"4 Der Herrscher",{"$f":"SUM(B40+B49+B58)","v":1},"Osiris"]
["5 Der Hierophant",{"$f":"(COUNTIF($Z$10:$DK$10,5))","v":4},"5 Der Hierophant",{"$f":"SUM(B41+B50)","v":5},"Isis"]
["6 Die Liebenden",{"$f":"(COUNTIF($Z$10:$DK$10,6))","v":0},"6 Die Liebenden",{"$f":"SUM(B42+B51)","v":0},"Horus"]
["7 Der Wagen",{"$f":"(COUNTIF($Z$10:$DK$10,7))","v":0},"7 Der Wagen",{"$f":"SUM(B43+B52)","v":2},"Osiris"]
["8 Die Kraft",{"$f":"(COUNTIF($Z$10:$DK$10,8))","v":0},"8 Die Kraft",{"$f":"SUM(B44+B53)","v":0},"Isis"]
["9 Der Eremit",{"$f":"(COUNTIF($Z$10:$DK$10,9))","v":1},"9 Der Eremit",{"$f":"SUM(B45+B54)","v":5},"Horus"]
["10 Das Rad des Schicksals",{"$f":"(COUNTIF($Z$10:$DK$10,10))","v":0},"1 Der Magier",null,"Osiris"]
["11 Die Gerechtigkeit",{"$f":"(COUNTIF($Z$10:$DK$10,11))","v":0},"2 Die Hohepriesterin",null,"Isis"]
["12 Der Gehängte",{"$f":"(COUNTIF($Z$10:$DK$10,12))","v":0},"3 Die Herrscherin",null,"Horus"]
["13 Der Tod",{"$f":"(COUNTIF($Z$10:$DK$10,13))","v":0},"4 Der Herrscher",null,"Osiris"]
["14 Die Mässigkeit",{"$f":"(COUNTIF($Z$10:$DK$10,14))","v":1},"5 Der Hierophant",null,"Isis"]
["15 Der Teufel",{"$f":"(COUNTIF($Z$10:$DK$10,15))","v":0},"6 Die Liebenden",null,"Horus"]
["16 Der Turm",{"$f":"(COUNTIF($Z$10:$DK$10,16))","v":2},"7 Der Wagen",null,"Osiris"]
["17 Der Stern",{"$f":"(COUNTIF($Z$10:$DK$10,17))","v":0},"8 Die Kraft",null,"Isis"]
["18 Der Mond",{"$f":"(COUNTIF($Z$10:$DK$10,18))","v":4},"9 Der Eremit",null,"Horus"]
["19 Die Sonne",{"$f":"(COUNTIF($Z$10:$DK$10,19))","v":1},"1 Der Magier",null,"Osiris"]
["20 Das Gericht",{"$f":"(COUNTIF($Z$10:$DK$10,20))","v":1},"2 Die Hohepriesterin",null,"Isis"]
["21 Die Welt",{"$f":"(COUNTIF($Z$10:$DK$10,21))","v":1},"3 Die Herrscherin",null,"Horus"]
["22 Der Narr",{"$f":"(COUNTIF($Z$10:$DK$10,22))","v":0},"4 Der Herrscher",null,"Osiris"]
["Summe aller Buchstaben",{"$f":"SUM(B37:B58)","v":18}]
[]
[]
["Die Namenskarten","Nr.","Karte","Konstellation","Gruppe"]
["Die Seelenkarte (Summe aller Vokale)",{"$f":"U25","v":7},{"$f":"IF(B63=1,\"Der Magier\",IF(B63=2,\"Die Hohepriesterin\",IF(B63=3,\"Die Herrscherin\",IF(B63=4,\"Der Herrscher\",IF(B63=5,\"Der Hierophant\",IF(B63=6,\"Die Liebenden\",IF(B63=7,\"Der Wagen\",IF(B63=8,\"Die Kraft\",IF(B63=9,\"Der Eremit\",IF(B63=10,\"Das Rad\",IF(B63=11,\"Die Gerechtigkeit\",IF(B63=12,\"Der Gehängte\",IF(B63=13,\"Der Tod\",IF(B63=14,\"Die Mässigkeit\",IF(B63=15,\"Der Teufel\",IF(B63=16,\"Der Turm\",IF(B63=17,\"Der Stern\",IF(B63=18,\"Der Mond\",IF(B63=19,\"Die Sonne\",IF(B63=20,\"Das Gericht\",IF(B63=21,\"Die Welt\",IF(B63=22,\"Der Narr\"))))))))))))))))))))))","v":"Der Wagen"},{"$f":"IF(OR(B63=1,B63=10,B63=19),\"1 Der Magier\",IF(OR(B63=2,B63=11,B63=20),\"2 Die Hohepriesterin\",IF(OR(B63=3,B63=12,B63=21),\"3 Die Herrscherin\",IF(OR(B63=4,B63=13,B63=22),\"4 Der Herrscher\",IF(OR(B63=5,B63=14),\"5 Der Hierophant\",IF(OR(B63=6,B63=15),\"6 Die Liebenden\",IF(OR(B63=7,B63=16),\"7 DerWagen\",IF(OR(B63 =8,B63=17),\"8 Die Kraft\",IF(OR(B63=9,B63=18),\"9 Der Eremit\")))))))))","v":"7 DerWagen"},{"$f":"IF(OR(B63=1,B63=4,B63=7,B63=10,B63=13,B63=16,B63=19,B63=22),\"Osiris\",IF(OR(B63=2,B63=5,B63=8,B63=11,B63=14,B63=17,B63=20),\"Isis\",IF(OR(B63=3,B63=6,B63=9,B63=12,B63=15,B63=18,B63=21),\"Horus\")))","v":"Osiris"}]
["Die Persönlichkeitskarte (Summe aller Konsonanten)",{"$f":"U33","v":8},{"$f":"IF(B64=1,\"Der Magier\",IF(B64=2,\"Die Hohepriesterin\",IF(B64=3,\"Die Herrscherin\",IF(B64=4,\"Der Herrscher\",IF(B64=5,\"Der Hierophant\",IF(B64=6,\"Die Liebenden\",IF(B64=7,\"Der Wagen\",IF(B64=8,\"Die Kraft\",IF(B64=9,\"Der Eremit\",IF(B64=10,\"Das Rad\",IF(B64=11,\"Die Gerechtigkeit\",IF(B64=12,\"Der Gehängte\",IF(B64=13,\"Der Tod\",IF(B64=14,\"Die Mässigkeit\",IF(B64=15,\"Der Teufel\",IF(B64=16,\"Der Turm\",IF(B64=17,\"Der Stern\",IF(B64=18,\"Der Mond\",IF(B64=19,\"Die Sonne\",IF(B64=20,\"Das Gericht\",IF(B64=21,\"Die Welt\",IF(B64=22,\"Der Narr\"))))))))))))))))))))))","v":"Die Kraft"},{"$f":"IF(OR(B64=1,B64=10,B64=19),\"1 Der Magier\",IF(OR(B64=2,B64=11,B64=20),\"2 Die Hohepriesterin\",IF(OR(B64=3,B64=12,B64=21),\"3 Die Herrscherin\",IF(OR(B64=4,B64=13,B64=22),\"4 Der Herrscher\",IF(OR(B64=5,B64=14),\"5 Der Hierophant\",IF(OR(B64=6,B64=15),\"6 Die Liebenden\",IF(OR(B64=7,B64=16),\"7 DerWagen\",IF(OR(B64 =8,B64=17),\"8 Die Kraft\",IF(OR(B64=9,B64=18),\"9 Der Eremit\")))))))))","v":"8 Die Kraft"},{"$f":"IF(OR(B64=1,B64=4,B64=7,B64=10,B64=13,B64=16,B64=19,B64=22),\"Osiris\",IF(OR(B64=2,B64=5,B64=8,B64=11,B64=14,B64=17,B64=20),\"Isis\",IF(OR(B64=3,B64=6,B64=9,B64=12,B64=15,B64=18,B64=21),\"Horus\")))","v":"Isis"}]
["Die Schicksalskarte  (Zahlen des gesamten Namens)",{"$f":"U18","v":6},{"$f":"IF(B65=1,\"Der Magier\",IF(B65=2,\"Die Hohepriesterin\",IF(B65=3,\"Die Herrscherin\",IF(B65=4,\"Der Herrscher\",IF(B65=5,\"Der Hierophant\",IF(B65=6,\"Die Liebenden\",IF(B65=7,\"Der Wagen\",IF(B65=8,\"Die Kraft\",IF(B65=9,\"Der Eremit\",IF(B65=10,\"Das Rad\",IF(B65=11,\"Die Gerechtigkeit\",IF(B65=12,\"Der Gehängte\",IF(B65=13,\"Der Tod\",IF(B65=14,\"Die Mässigkeit\",IF(B65=15,\"Der Teufel\",IF(B65=16,\"Der Turm\",IF(B65=17,\"Der Stern\",IF(B65=18,\"Der Mond\",IF(B65=19,\"Die Sonne\",IF(B65=20,\"Das Gericht\",IF(B65=21,\"Die Welt\",IF(B65=22,\"Der Narr\"))))))))))))))))))))))","v":"Die Liebenden"},{"$f":"IF(OR(B65=1,B65=10,B65=19),\"1 Der Magier\",IF(OR(B65=2,B65=11,B65=20),\"2 Die Hohepriesterin\",IF(OR(B65=3,B65=12,B65=21),\"3 Die Herrscherin\",IF(OR(B65=4,B65=13,B65=22),\"4 Der Herrscher\",IF(OR(B65=5,B65=14),\"5 Der Hierophant\",IF(OR(B65=6,B65=15),\"6 Die Liebenden\",IF(OR(B65=7,B65=16),\"7 DerWagen\",IF(OR(B65 =8,B65=17),\"8 Die Kraft\",IF(OR(B65=9,B65=18),\"9 Der Eremit\")))))))))","v":"6 Die Liebenden"},{"$f":"IF(OR(B65=1,B65=4,B65=7,B65=10,B65=13,B65=16,B65=19,B65=22),\"Osiris\",IF(OR(B65=2,B65=5,B65=8,B65=11,B65=14,B65=17,B65=20),\"Isis\",IF(OR(B65=3,B65=6,B65=9,B65=12,B65=15,B65=18,B65=21),\"Horus\")))","v":"Horus"}]
["Das individuelle Selbst (Rufname)",{"$f":"U9","v":6},{"$f":"IF(B66=1,\"Der Magier\",IF(B66=2,\"Die Hohepriesterin\",IF(B66=3,\"Die Herrscherin\",IF(B66=4,\"Der Herrscher\",IF(B66=5,\"Der Hierophant\",IF(B66=6,\"Die Liebenden\",IF(B66=7,\"Der Wagen\",IF(B66=8,\"Die Kraft\",IF(B66=9,\"Der Eremit\",IF(B66=10,\"Das Rad\",IF(B66=11,\"Die Gerechtigkeit\",IF(B66=12,\"Der Gehängte\",IF(B66=13,\"Der Tod\",IF(B66=14,\"Die Mässigkeit\",IF(B66=15,\"Der Teufel\",IF(B66=16,\"Der Turm\",IF(B66=17,\"Der Stern\",IF(B66=18,\"Der Mond\",IF(B66=19,\"Die Sonne\",IF(B66=20,\"Das Gericht\",IF(B66=21,\"Die Welt\",IF(B66=22,\"Der Narr\"))))))))))))))))))))))","v":"Die Liebenden"},{"$f":"IF(OR(B66=1,B66=10,B66=19),\"1 Der Magier\",IF(OR(B66=2,B66=11,B66=20),\"2 Die Hohepriesterin\",IF(OR(B66=3,B66=12,B66=21),\"3 Die Herrscherin\",IF(OR(B66=4,B66=13,B66=22),\"4 Der Herrscher\",IF(OR(B66=5,B66=14),\"5 Der Hierophant\",IF(OR(B66=6,B66=15),\"6 Die Liebenden\",IF(OR(B66=7,B66=16),\"7 DerWagen\",IF(OR(B66 =8,B66=17),\"8 Die Kraft\",IF(OR(B66=9,B66=18),\"9 Der Eremit\")))))))))","v":"6 Die Liebenden"},{"$f":"IF(OR(B66=1,B66=4,B66=7,B66=10,B66=13,B66=16,B66=19,B66=22),\"Osiris\",IF(OR(B66=2,B66=5,B66=8,B66=11,B66=14,B66=17,B66=20),\"Isis\",IF(OR(B66=3,B66=6,B66=9,B66=12,B66=15,B66=18,B66=21),\"Horus\")))","v":"Horus"}]
["Das verborgene Selbst (mittlerer Name 1)",{"$f":"U11","v":8},{"$f":"IF(B67=1,\"Der Magier\",IF(B67=2,\"Die Hohepriesterin\",IF(B67=3,\"Die Herrscherin\",IF(B67=4,\"Der Herrscher\",IF(B67=5,\"Der Hierophant\",IF(B67=6,\"Die Liebenden\",IF(B67=7,\"Der Wagen\",IF(B67=8,\"Die Kraft\",IF(B67=9,\"Der Eremit\",IF(B67=10,\"Das Rad\",IF(B67=11,\"Die Gerechtigkeit\",IF(B67=12,\"Der Gehängte\",IF(B67=13,\"Der Tod\",IF(B67=14,\"Die Mässigkeit\",IF(B67=15,\"Der Teufel\",IF(B67=16,\"Der Turm\",IF(B67=17,\"Der Stern\",IF(B67=18,\"Der Mond\",IF(B67=19,\"Die Sonne\",IF(B67=20,\"Das Gericht\",IF(B67=21,\"Die Welt\",IF(B67=22,\"Der Narr\",0))))))))))))))))))))))","v":"Die Kraft"},{"$f":"IF(OR(B67=1,B67=10,B67=19),\"1 Der Magier\",IF(OR(B67=2,B67=11,B67=20),\"2 Die Hohepriesterin\",IF(OR(B67=3,B67=12,B67=21),\"3 Die Herrscherin\",IF(OR(B67=4,B67=13,B67=22),\"4 Der Herrscher\",IF(OR(B67=5,B67=14),\"5 Der Hierophant\",IF(OR(B67=6,B67=15),\"6 Die Liebenden\",IF(OR(B67=7,B67=16),\"7 DerWagen\",IF(OR(B67 =8,B67=17),\"8 Die Kraft\",IF(OR(B67=9,B67=18),\"9 Der Eremit\",0)))))))))","v":"8 Die Kraft"},{"$f":"IF(OR(B67=1,B67=4,B67=7,B67=10,B67=13,B67=16,B67=19,B67=22),\"Osiris\",IF(OR(B67=2,B67=5,B67=8,B67=11,B67=14,B67=17,B67=20),\"Isis\",IF(OR(B67=3,B67=6,B67=9,B67=12,B67=15,B67=18,B67=21),\"Horus\",0)))","v":"Isis"}]
["Das verborgene Selbst (mittlerer Name 2)",{"$f":"U13","v":0},0,0,0]
["Das verborgene Selbst (mittlerer Name 3)",{"$f":"U15","v":0},0,0,0]
["Das soziale Selbst (Nachname)",{"$f":"U17","v":1},"Der Magier","1 Der Magier","Osiris"]
["Die Persönlichkeitskarte (Geburtsdatum)",{"$f":"AF14","v":19},"Die Sonne","1 Der Magier","Osiris"]
["Lebenspotential (Geburtsdatum und Namen)",{"$f":"AF13","v":16},"Der Turm","7 DerWagen","Osiris"]
[]
[]
[]
[]
[]
["Pasteur",{"$f":"SUMPRODUCT(CODE(MID(UPPER(A78),ROW(INDIRECT(\"1:\"&LEN(A78))),1))-64)","v":100},{"$f":"LEN(A78)","v":7}]
["Andre",{"$f":"SUMPRODUCT(CODE(MID(UPPER(A79),ROW(INDIRECT(\"1:\"&LEN(A79))),1))-64)","v":42}]

{"sheet":"Tabelle1","index":5,"n_rows":11,"n_cols":10,"rows_kept":11,"cut":false,"hidden":true,"merged":[]}
["Numerologie nach Glynis McCants","für",{"$f":"Jahreskarten!E8","v":"Zum "},{"$f":"Jahreskarten!F8","v":"Beispiel"}]
["Geben Sie Ihren Namen auf der Seite \"Numerologie 2\"  und Ihren Geburtstag auf der Seite \"Jahreskarten\" ein."]
[]
[null,"Summe","Quersumme","Karte Nr. ","Karte","Numerologie","Partnerzahlen","Kompatible Zahlen","Problemzahlen","Neutrale Zahlen"]
["Seelenzahl (Vokale im Namen)",{"$f":"'Numerologie 2'!X42","v":51},{"$f":"IF(B5>22,SUMPRODUCT(MID(B5,ROW(INDIRECT(\"1:\"&LEN(B5))),1)*1),B5)","v":6},{"$f":"IF(C5>22,SUMPRODUCT(VALUE(MID(C5,ROW(INDIRECT(\"$b1:$A\"&LEN(C5))),1))),C5)","v":6},{"$f":"IF(D5=1,\"Der Magier\",IF(D5=2,\"Die Hohepriesterin\",IF(D5=3,\"Die Herrscherin\",IF(D5=4,\"Der Herrscher\",IF(D5=5,\"Der Hierophant\",IF(D5=6,\"Die Liebenden\",IF(D5=7,\"Der Wagen\",IF(D5=8,\"Die Kraft\",IF(D5=9,\"Der Eremit\",IF(D5=10,\"Das Rad\",IF(D5=11,\"Die Gerechtigkeit\",IF(D5=12,\"Der Gehängte\",IF(D5=13,\"Der Tod\",IF(D5=14,\"Die Mässigkeit\",IF(D5=15,\"Der Teufel\",IF(D5=16,\"Der Turm\",IF(D5=17,\"Der Stern\",IF(D5=18,\"Der Mond\",IF(D5=19,\"Die Sonne\",IF(D5=20,\"Das Gericht\",IF(D5=21,\"Die Welt\",IF(D5=22,\"Der Narr\"))))))))))))))))))))))","v":"Die Liebenden"},{"$f":"(MOD(D5-TRUNC(D5/9)*9,-9)+9)*(D5>0)","v":6},{"$f":"IF(OR(F5=1,F5=5,F5=7),\"1, 5, 7\",IF(OR(F5=2,F5=4,F5=8),\"2, 4, 8\",IF(OR(F5=3,F5=6,F5=9),\"3, 6, 9\",)))","v":"3, 6, 9"},{"$f":"IF(F5=1,\"2, 3, 9\",IF(F5=2,\"1, 3, 6, 9\",IF(F5=3,\"1, 2, 5\",IF(F5=4,\"7, 6\",IF(F5=5,\"3, 9\",IF(F5=6,\"2, 4, 8\",IF(F5=7,\"4\",IF(F5=8,\"6\",IF(F5=9,\"1, 2, 5\")))))))))","v":"2, 4, 8"},{"$f":"IF(F5=1,\"4, 6\",IF(F5=2,\"5, 7\",IF(F5=3,\"4, 7, 8\",IF(F5=4,\"1, 3, 5, 9\",IF(F5=5,\"2, 4, 6\",IF(F5=6,\"1, 5, 7\",IF(F5=7,\"2, 3, 6, 8, 9\",IF(F5=8,\"3, 7, 9\",IF(F5=9,\"4, 7, 8\",)))))))))","v":"1, 5, 7"},{"$f":"IF(F5=1,8,IF(F5=5,8,IF(F5=8,\"1, 5\",0)))","v":0}]
["Persönlichkeitszahl (Konsonanten im Namen)",{"$f":"'Numerologie 2'!AA42","v":106},{"$f":"IF(B6>22,SUMPRODUCT(MID(B6,ROW(INDIRECT(\"1:\"&LEN(B6))),1)*1),B6)","v":7},{"$f":"IF(C6>22,SUMPRODUCT(VALUE(MID(C6,ROW(INDIRECT(\"$b1:$A\"&LEN(C6))),1))),C6)","v":7},"Der Wagen",{"$f":"(MOD(D6-TRUNC(D6/9)*9,-9)+9)*(D6>0)","v":7},"1, 5, 7",{"$f":"IF(F6=1,\"2, 3, 9\",IF(F6=2,\"1, 3, 6, 9\",IF(F6=3,\"1, 2, 5\",IF(F6=4,\"7, 6\",IF(F6=5,\"3, 9\",IF(F6=6,\"2, 4, 8\",IF(F6=7,\"4\",IF(F6=8,\"6\",IF(F6=9,\"1, 2, 5\")))))))))","v":"4"},{"$f":"IF(F6=1,\"4, 6\",IF(F6=2,\"5, 7\",IF(F6=3,\"4, 7, 8\",IF(F6=4,\"1, 3, 5, 9\",IF(F6=5,\"2, 4, 6\",IF(F6=6,\"1, 5, 7\",IF(F6=7,\"2, 3, 6, 8, 9\",IF(F6=8,\"3, 7, 9\",IF(F6=9,\"4, 7, 8\",)))))))))","v":"2, 3, 6, 8, 9"},{"$f":"IF(F6=1,8,IF(F6=5,8,IF(F6=8,\"1, 5\",0)))","v":0}]
["Namenszahl (Summe aller Buchstaben im Namen)",{"$f":"'Numerologie 2'!C15","v":157},13,13,"Der Tod",4,"2, 4, 8","7, 6","1, 3, 5, 9",0]
["Geburtstagszahl (Tag der Geburt)",{"$f":"Jahreskarten!C8","v":12},12,12,"Der Gehängte",3,"3, 6, 9","1, 2, 5","4, 7, 8",0]
["Lebensaufgabenzahl (Summe des Geburtsdatums)",{"$f":"Jahreskarten!J13","v":1981},19,19,"Die Sonne",1,"1, 5, 7","2, 3, 9","4, 6",8]
["Einstellungszahl (Tag und Monat der Geburt)",{"$f":"Jahreskarten!B8+Jahreskarten!C8","v":19},19,19,"Die Sonne",1,"1, 5, 7","2, 3, 9","4, 6",8]
["Machtzahl",{"$f":"B7+B9","v":2138},14,14,"Die Mässigkeit",5,"1, 5, 7","3, 9","2, 4, 6",8]

{"sheet":"Numerologie","index":6,"n_rows":42,"n_cols":6,"rows_kept":42,"cut":false,"hidden":false,"merged":[]}
[]
["Tragen Sie immer zuerst auf dem Blatt \"Jahreskarten\" Ihren Geburtstag ein!"]
[]
[]
["Die Persönlichkeits- und Wesenskarten für",{"$f":"Jahreskarten!E8","v":"Zum "},{"$f":"Jahreskarten!F8","v":"Beispiel"}]
["Die Persönlichkeitskarte",{"$f":"Jahreskarten!H13","v":19},{"$f":"IF(B6=1,\"Der Magier\",IF(B6=2,\"Die Hohepriesterin\",IF(B6=3,\"Die Herrscherin\",IF(B6=4,\"Der Herrscher\",IF(B6=5,\"Der Hierophant\",IF(B6=6,\"Die Liebenden\",IF(B6=7,\"Der Wagen\",IF(B6=8,\"Die Kraft\",IF(B6=9,\"Der Eremit\",IF(B6=10,\"Das Rad\",IF(B6=11,\"Die Gerechtigkeit\",IF(B6=12,\"Der Gehängte\",IF(B6=13,\"Der Tod\",IF(B6=14,\"Die Mässigkeit\",IF(B6=15,\"Der Teufel\",IF(B6=16,\"Der Turm\",IF(B6=17,\"Der Stern\",IF(B6=18,\"Der Mond\",IF(B6=19,\"Die Sonne\",IF(B6=20,\"Das Gericht\",IF(B6=21,\"Die Welt\",IF(B6=22,\"Der Narr\"))))))))))))))))))))))","v":"Die Sonne"},{"$f":"IF(B6<11,\"Tagesbogen\",IF(B6=22,\"Tagesbogen\",\"Nachtbogen\"))","v":"Nachtbogen"}]
["Die Wesenskarte",{"$f":"Jahreskarten!I13","v":10},{"$f":"IF(B7=1,\"Der Magier\",IF(B7=2,\"Die Hohepriesterin\",IF(B7=3,\"Die Herrscherin\",IF(B7=4,\"Der Herrscher\",IF(B7=5,\"Der Hierophant\",IF(B7=6,\"Die Liebenden\",IF(B7=7,\"Der Wagen\",IF(B7=8,\"Die Kraft\",IF(B7=9,\"Der Eremit\",IF(B7=10,\"Das Rad\",IF(B7=11,\"Die Gerechtigkeit\",IF(B7=12,\"Der Gehängte\",IF(B7=13,\"Der Tod\",IF(B7=14,\"Die Mässigkeit\",IF(B7=15,\"Der Teufel\",IF(B7=16,\"Der Turm\",IF(B7=17,\"Der Stern\",IF(B7=18,\"Der Mond\",IF(B7=19,\"Die Sonne\",IF(B7=20,\"Das Gericht\",IF(B7=21,\"Die Welt\",IF(B7=22,\"Der Narr\"))))))))))))))))))))))","v":"Das Rad"},{"$f":"IF(B7<11,\"Tagesbogen\",IF(B7=22,\"Tagesbogen\",\"Nachtbogen\"))","v":"Tagesbogen"}]
["Ev. zweite Wesenskarte",{"$f":"IF(B6=1,19,IF(B6=2,20,IF(B6=3,21,IF(B6=4,22,IF(B6=10,19,IF(B6=11,20,IF(B6=12,21,IF(B6=13,22,IF(B6=19,1,IF(B6=20,11,IF(B6=21,12,IF(B6=22,13,\"Keine\"))))))))))))","v":1},{"$f":"IF(B8=1,\"Der Magier\",IF(B8=2,\"Die Hohepriesterin\",IF(B8=3,\"Die Herrscherin\",IF(B8=4,\"Der Herrscher\",IF(B8=5,\"Der Hierophant\",IF(B8=6,\"Die Liebenden\",IF(B8=7,\"Der Wagen\",IF(B8=8,\"Die Kraft\",IF(B8=9,\"Der Eremit\",IF(B8=10,\"Das Rad\",IF(B8=11,\"Die Gerechtigkeit\",IF(B8=12,\"Der Gehängte\",IF(B8=13,\"Der Tod\",IF(B8=14,\"Die Mässigkeit\",IF(B8=15,\"Der Teufel\",IF(B8=16,\"Der Turm\",IF(B8=17,\"Der Stern\",IF(B8=18,\"Der Mond\",IF(B8=19,\"Die Sonne\",IF(B8=20,\"Das Gericht\",IF(B8=21,\"Die Welt\",IF(B8=22,\"Der Narr\",0))))))))))))))))))))))","v":"Der Magier"},{"$f":"IF(B8<11,\"Tagesbogen\",IF(B8=22,\"Tagesbogen\",IF(B8=\"Keine\",\"-\",\"Nachtbogen\")))","v":"Tagesbogen"}]
["Typus normal oder besonders",{"$f":"IF(B6=11,\"Besonders\",IF(B6=12,\"Besonders\",IF(B6=13,\"Besonders\",IF(B6=14,\"Besonders\",IF(B6=15,\"Besonders\",IF(B6=16,\"Besonders\",IF(B6=17,\"Besonders\",IF(B6=18,\"Besonders\",\"Normal\"))))))))","v":"Normal"}]
["Karmisches Jahr",{"$f":"Jahreskarten!J13","v":1981}]
["Karten der Aufgaben und Gelegenheiten","Persönliche Ziele:",{"$f":"IF($B$6=22,\"As Stäbe\",IF($B$6=1,\"As Stäbe\",IF($B$6=2,\"As Stäbe\",IF($B$6=3,\"2 Stäbe\",IF($B$6=4,\"2 Stäbe\",IF($B$6=5,\"2 Stäbe\",IF($B$6=6,\"3 Stäbe\",IF($B$6=7,\"3 Stäbe\",IF($B$6=8,\"4 Stäbe\",IF($B$6=9,\"4 Stäbe\",IF($B$6=10,\"4 Stäbe\",IF($B$6=11,\"5 Stäbe\",IF($B$6=12,\"5 Stäbe\",IF($B$6=13,\"6 Stäbe\",IF($B$6=14,\"6 Stäbe\",IF($B$6=15,\"6 Stäbe\",IF($B$6=16,\"7 Stäbe\",IF($B$6=17,\"7 Stäbe\",IF($B$6=18,\"7 Stäbe\",IF($B$6=19,\"8 Stäbe\",IF($B$6=20,\"8 Stäbe\",IF($B$6=21,\"9 Stäbe\"))))))))))))))))))))))","v":"8 Stäbe"},{"$f":"IF($B$6=22,\"2 Stäbe\",IF($B$6=1,\"3 Stäbe\",IF($B$6=2,\"6 Stäbe\",IF($B$6=3,\"3 Stäbe\",IF($B$6=4,\"6 Stäbe\",IF($B$6=5,\"4 Stäbe\",IF($B$6=6,\"6 Stäbe\",IF($B$6=7,\"5 Stäbe\",IF($B$6=8,\"5 Stäbe\",IF($B$6=9,\"6 Stäbe\",IF($B$6=10,\"7 Stäbe\",IF($B$6=11,\"6 Stäbe\",IF($B$6=12,\"8 Stäbe\",IF($B$6=13,\"7 Stäbe\",IF($B$6=14,\"9 Stäbe\",IF($B$6=15,\"8 Stäbe\",IF($B$6=16,\"8 Stäbe\",IF($B$6=17,\"9 Stäbe\",IF($B$6=18,\"10 Stäbe\",IF($B$6=19,\"9 Stäbe\",IF($B$6=20,\"10 Stäbe\",IF($B$6=21,\"10 Stäbe\"))))))))))))))))))))))","v":"9 Stäbe"}]
[null,"Beziehung:",{"$f":"IF($B$6=22,\"As Kelche\",IF($B$6=1,\"As Kelche\",IF($B$6=2,\"As Kelche\",IF($B$6=3,\"2 Kelche\",IF($B$6=4,\"2 Kelche\",IF($B$6=5,\"2 Kelche\",IF($B$6=6,\"3 Kelche\",IF($B$6=7,\"3 Kelche\",IF($B$6=8,\"4 Kelche\",IF($B$6=9,\"4 Kelche\",IF($B$6=10,\"4 Kelche\",IF($B$6=11,\"5 Kelche\",IF($B$6=12,\"5 Kelche\",IF($B$6=13,\"6 Kelche\",IF($B$6=14,\"6 Kelche\",IF($B$6=15,\"6 Kelche\",IF($B$6=16,\"7 Kelche\",IF($B$6=17,\"7 Kelche\",IF($B$6=18,\"7 Kelche\",IF($B$6=19,\"8 Kelche\",IF($B$6=20,\"8 Kelche\",IF($B$6=21,\"9 Kelche\"))))))))))))))))))))))","v":"8 Kelche"},{"$f":"IF($B$6=22,\"2 Kelche\",IF($B$6=1,\"3 Kelche\",IF($B$6=2,\"6 Kelche\",IF($B$6=3,\"3 Kelche\",IF($B$6=4,\"6 Kelche\",IF($B$6=5,\"4 Kelche\",IF($B$6=6,\"6 Kelche\",IF($B$6=7,\"5 Kelche\",IF($B$6=8,\"5 Kelche\",IF($B$6=9,\"6 Kelche\",IF($B$6=10,\"7 Kelche\",IF($B$6=11,\"6 Kelche\",IF($B$6=12,\"8 Kelche\",IF($B$6=13,\"7 Kelche\",IF($B$6=14,\"9 Kelche\",IF($B$6=15,\"8 Kelche\",IF($B$6=16,\"8 Kelche\",IF($B$6=17,\"9 Kelche\",IF($B$6=18,\"10 Kelche\",IF($B$6=19,\"9 Kelche\",IF($B$6=20,\"10 Kelche\",IF($B$6=21,\"10 Kelche\"))))))))))))))))))))))","v":"9 Kelche"}]
[null,"Soziales Umfeld:",{"$f":"IF($B$6=22,\"As Schwerter\",IF($B$6=1,\"As Schwerter\",IF($B$6=2,\"As Schwerter\",IF($B$6=3,\"2 Schwerter\",IF($B$6=4,\"2 Schwerter\",IF($B$6=5,\"2 Schwerter\",IF($B$6=6,\"3 Schwerter\",IF($B$6=7,\"3 Schwerter\",IF($B$6=8,\"4 Schwerter\",IF($B$6=9,\"4 Schwerter\",IF($B$6=10,\"4 Schwerter\",IF($B$6=11,\"5 Schwerter\",IF($B$6=12,\"5 Schwerter\",IF($B$6=13,\"6 Schwerter\",IF($B$6=14,\"6 Schwerter\",IF($B$6=15,\"6 Schwerter\",IF($B$6=16,\"7 Schwerter\",IF($B$6=17,\"7 Schwerter\",IF($B$6=18,\"7 Schwerter\",IF($B$6=19,\"8 Schwerter\",IF($B$6=20,\"8 Schwerter\",IF($B$6=21,\"9 Schwerter\"))))))))))))))))))))))","v":"8 Schwerter"},{"$f":"IF($B$6=22,\"2 Schwerter\",IF($B$6=1,\"3 Schwerter\",IF($B$6=2,\"6 Schwerter\",IF($B$6=3,\"3 Schwerter\",IF($B$6=4,\"6 Schwerter\",IF($B$6=5,\"4 Schwerter\",IF($B$6=6,\"6 Schwerter\",IF($B$6=7,\"5 Schwerter\",IF($B$6=8,\"5 Schwerter\",IF($B$6=9,\"6 Kelche\",IF($B$6=10,\"7 Schwerter\",IF($B$6=11,\"6 Schwerter\",IF($B$6=12,\"8 Schwerter\",IF($B$6=13,\"7 Schwerter\",IF($B$6=14,\"9 Schwerter\",IF($B$6=15,\"8 Schwerter\",IF($B$6=16,\"8 Schwerter\",IF($B$6=17,\"9 Schwerter\",IF($B$6=18,\"10 Schwerter\",IF($B$6=19,\"9 Schwerter\",IF($B$6=20,\"10 Schwerter\",IF($B$6=21,\"10 Schwerter\"))))))))))))))))))))))","v":"9 Schwerter"}]
[null,"Beruf, Geld:",{"$f":"IF($B$6=22,\"As Münzen\",IF($B$6=1,\"As Münzen\",IF($B$6=2,\"As Münzen\",IF($B$6=3,\"2 Münzen\",IF($B$6=4,\"2 Münzen\",IF($B$6=5,\"2 Münzen\",IF($B$6=6,\"3 Münzen\",IF($B$6=7,\"3 Münzen\",IF($B$6=8,\"4 Münzen\",IF($B$6=9,\"4 Münzen\",IF($B$6=10,\"4 Münzen\",IF($B$6=11,\"5 Münzen\",IF($B$6=12,\"5 Münzen\",IF($B$6=13,\"6 Münzen\",IF($B$6=14,\"6 Münzen\",IF($B$6=15,\"6 Münzen\",IF($B$6=16,\"7 Münzen\",IF($B$6=17,\"7 Münzen\",IF($B$6=18,\"7 Münzen\",IF($B$6=19,\"8 Münzen\",IF($B$6=20,\"8 Münzen\",IF($B$6=21,\"9 Münzen\"))))))))))))))))))))))","v":"8 Münzen"},{"$f":"IF($B$6=22,\"2 Münzen\",IF($B$6=1,\"3 Münzen\",IF($B$6=2,\"6 Münzen\",IF($B$6=3,\"3 Münzen\",IF($B$6=4,\"6 Münzen\",IF($B$6=5,\"4 Münzen\",IF($B$6=6,\"6 Münzen\",IF($B$6=7,\"5 Münzen\",IF($B$6=8,\"5 Münzen\",IF($B$6=9,\"6 Münzen\",IF($B$6=10,\"7 Münzen\",IF($B$6=11,\"6 Münzen\",IF($B$6=12,\"8 Münzen\",IF($B$6=13,\"7 Münzen\",IF($B$6=14,\"9 Kelche\",IF($B$6=15,\"8 Münzen\",IF($B$6=16,\"8 Münzen\",IF($B$6=17,\"9 Münzen\",IF($B$6=18,\"10 Münzen\",IF($B$6=19,\"9 Münzen\",IF($B$6=20,\"10 Münzen\",IF($B$6=21,\"10 Münzen\"))))))))))))))))))))))","v":"9 Münzen"}]
["Konstellation der Persönlichkeitskarte",{"$f":"IF(OR(B6=1,B6=10,B6=19),\"1 Der Magier\",IF(OR(B6=2,B6=11,B6=20),\"2 Die Hohepriesterin\",IF(OR(B6=3,B6=12,B6=21),\"3 Die Herrscherin\",IF(OR(B6=4,B6=13,B6=22),\"4 Der Herrscher\",IF(OR(B6=5,B6=14),\"5 Der Hierophant\",IF(OR(B6=6,B6=15),\"6 Die Liebenden\",IF(OR(B6=7,B6=16),\"7 DerWagen\",IF(OR(B6=8,B6=17),\"8 Die Kraft\",IF(OR(B6=9,B6=18),\"9 Der Eremit\")))))))))","v":"1 Der Magier"}]
["Gruppe der Persönlichkeitskarte",{"$f":"IF(OR(B6=1,B6=4,B6=7,B6=10,B6=13,B6=16,B6=19,B6=22),\"Osiris\",IF(OR(B6=2,B6=5,B6=8,B6=11,B6=14,B6=17,B6=20),\"Isis\",IF(OR(B6=3,B6=6,B6=9,B6=12,B6=15,B6=18,B6=21),\"Horus\")))","v":"Osiris"}]
[]
["Die Geburtstagskarte",{"$f":"F18","v":12},{"$f":"IF(B18=1,\"Der Magier\",IF(B18=2,\"Die Hohepriesterin\",IF(B18=3,\"Die Herrscherin\",IF(B18=4,\"Der Herrscher\",IF(B18=5,\"Der Hierophant\",IF(B18=6,\"Die Liebenden\",IF(B18=7,\"Der Wagen\",IF(B18=8,\"Die Kraft\",IF(B18=9,\"Der Eremit\",IF(B18=10,\"Das Rad\",IF(B18=11,\"Die Gerechtigkeit\",IF(B18=12,\"Der Gehängte\",IF(B18=13,\"Der Tod\",IF(B18=14,\"Die Mässigkeit\",IF(B18=15,\"Der Teufel\",IF(B18=16,\"Der Turm\",IF(B18=17,\"Der Stern\",IF(B18=18,\"Der Mond\",IF(B18=19,\"Die Sonne\",IF(B18=20,\"Das Gericht\",IF(B18=21,\"Die Welt\",IF(B18=22,\"Der Narr\"))))))))))))))))))))))","v":"Der Gehängte"},null,{"$f":"Jahreskarten!C8","v":12},{"$f":"IF(E18>22,SUMPRODUCT(VALUE(MID(E18,ROW(INDIRECT(\"$b1:$A\"&LEN(E18))),1))),E18)","v":12}]
["Die Konstellation der Geburtstagskarte",{"$f":"IF(B18>9,SUMPRODUCT(VALUE(MID(B18,ROW(INDIRECT(\"$b1:$A\"&LEN(B18))),1))),B18)","v":3},{"$f":"IF(B19=1,\"Der Magier\",IF(B19=2,\"Die Hohepriesterin\",IF(B19=3,\"Die Herrscherin\",IF(B19=4,\"Der Herrscher\",IF(B19=5,\"Der Hierophant\",IF(B19=6,\"Die Liebenden\",IF(B19=7,\"Der Wagen\",IF(B19=8,\"Die Kraft\",IF(B19=9,\"Der Eremit\",IF(B19=10,\"Das Rad\",IF(B19=11,\"Die Gerechtigkeit\",IF(B19=12,\"Der Gehängte\",IF(B19=13,\"Der Tod\",IF(B19=14,\"Die Mässigkeit\",IF(B19=15,\"Der Teufel\",IF(B19=16,\"Der Turm\",IF(B19=17,\"Der Stern\",IF(B19=18,\"Der Mond\",IF(B19=19,\"Die Sonne\",IF(B19=20,\"Das Gericht\",IF(B19=21,\"Die Welt\",IF(B19=22,\"Der Narr\"))))))))))))))))))))))","v":"Die Herrscherin"}]
["Die Gruppe der Geburtstagskarte",{"$f":"IF(OR(B18=1,B18=4,B18=7,B18=10,B18=13,B18=16,B18=19,B18=22),\"Osiris\",IF(OR(B18=2,B18=5,B18=8,B18=11,B18=14,B18=17,B18=20),\"Isis\",IF(OR(B18=3,B18=6,B18=9,B18=12,B18=15,B18=18,B18=21),\"Horus\")))","v":"Horus"}]
[null,null,null,"Hier das gewünschte"]
["Die Jahreskarten","Geburtsmonat","Geburtstag","Jahr eintragen:","Summe","Quersumme"]
["Die Berechnung",{"$f":"Jahreskarten!B8","v":7},{"$f":"Jahreskarten!C8","v":12},2023,{"$f":"B23+C23+D23","v":2042},{"$f":"SUMPRODUCT(MID(E23,ROW(INDIRECT(\"1:\"&LEN(E23))),1)*1)","v":8}]
["Die Jahreskarte",{"$f":"IF(F23>22,SUMPRODUCT(VALUE(MID(F23,ROW(INDIRECT(\"$b1:$A\"&LEN(F23))),1))),F23)","v":8},{"$f":"IF(B24=1,\"Der Magier\",IF(B24=2,\"Die Hohepriesterin\",IF(B24=3,\"Die Herrscherin\",IF(B24=4,\"Der Herrscher\",IF(B24=5,\"Der Hierophant\",IF(B24=6,\"Die Liebenden\",IF(B24=7,\"Der Wagen\",IF(B24=8,\"Die Kraft\",IF(B24=9,\"Der Eremit\",IF(B24=10,\"Das Rad\",IF(B24=11,\"Die Gerechtigkeit\",IF(B24=12,\"Der Gehängte\",IF(B24=13,\"Der Tod\",IF(B24=14,\"Die Mässigkeit\",IF(B24=15,\"Der Teufel\",IF(B24=16,\"Der Turm\",IF(B24=17,\"Der Stern\",IF(B24=18,\"Der Mond\",IF(B24=19,\"Die Sonne\",IF(B24=20,\"Das Gericht\",IF(B24=21,\"Die Welt\",IF(B24=22,\"Der Narr\"))))))))))))))))))))))","v":"Die Kraft"},{"$f":"IF(B24<11,\"Tagesbogen\",IF(B24=22,\"-\",IF(B24=21,\"-\",\"Nachtbogen\")))","v":"Tagesbogen"}]
["Die Wesenskarte des Jahres",{"$f":"IF(B24>9,SUMPRODUCT(VALUE(MID(B24,ROW(INDIRECT(\"$b1:$A\"&LEN(B24))),1))),B24+9)","v":17},{"$f":"IF(B25=1,\"Der Magier\",IF(B25=2,\"Die Hohepriesterin\",IF(B25=3,\"Die Herrscherin\",IF(B25=4,\"Der Herrscher\",IF(B25=5,\"Der Hierophant\",IF(B25=6,\"Die Liebenden\",IF(B25=7,\"Der Wagen\",IF(B25=8,\"Die Kraft\",IF(B25=9,\"Der Eremit\",IF(B25=10,\"Das Rad\",IF(B25=11,\"Die Gerechtigkeit\",IF(B25=12,\"Der Gehängte\",IF(B25=13,\"Der Tod\",IF(B25=14,\"Die Mässigkeit\",IF(B25=15,\"Der Teufel\",IF(B25=16,\"Der Turm\",IF(B25=17,\"Der Stern\",IF(B25=18,\"Der Mond\",IF(B25=19,\"Die Sonne\",IF(B25=20,\"Das Gericht\",IF(B25=21,\"Die Welt\",IF(B25=22,\"Der Narr\"))))))))))))))))))))))","v":"Der Stern"},{"$f":"IF(B25<11,\"Tagesbogen\",IF(B25=22,\"-\",IF(B25=21,\"-\",\"Nachtbogen\")))","v":"Nachtbogen"}]
["Ev. zweite Wesenskarte des Jahres",{"$f":"IF(B24=1,19,IF(B24=2,20,IF(B24=3,21,IF(B24=4,22,IF(B24=10,19,IF(B24=11,20,IF(B24=12,21,IF(B24=13,22,IF(B24=19,1,IF(B24=20,11,IF(B24=21,12,IF(B24=22,13,\"Keine\"))))))))))))","v":"Keine"},{"$f":"IF(B26=1,\"Der Magier\",IF(B26=2,\"Die Hohepriesterin\",IF(B26=3,\"Die Herrscherin\",IF(B26=4,\"Der Herrscher\",IF(B26=5,\"Der Hierophant\",IF(B26=6,\"Die Liebenden\",IF(B26=7,\"Der Wagen\",IF(B26=8,\"Die Kraft\",IF(B26=9,\"Der Eremit\",IF(B26=10,\"Das Rad\",IF(B26=11,\"Die Gerechtigkeit\",IF(B26=12,\"Der Gehängte\",IF(B26=13,\"Der Tod\",IF(B26=14,\"Die Mässigkeit\",IF(B26=15,\"Der Teufel\",IF(B26=16,\"Der Turm\",IF(B26=17,\"Der Stern\",IF(B26=18,\"Der Mond\",IF(B26=19,\"Die Sonne\",IF(B26=20,\"Das Gericht\",IF(B26=21,\"Die Welt\",IF(B26=22,\"Der Narr\",0))))))))))))))))))))))","v":0},{"$f":"IF(B26<11,\"Tagesbogen\",IF(B26=22,\"-\",IF(B26=21,\"-\",IF(B26=\"Keine\",\"-\",\"Nachtbogen\"))))","v":"-"}]
["Typus normal oder besonders",{"$f":"IF(B24=11,\"Besonders\",IF(B24=12,\"Besonders\",IF(B24=13,\"Besonders\",IF(B24=14,\"Besonders\",IF(B24=15,\"Besonders\",IF(B24=16,\"Besonders\",IF(B24=17,\"Besonders\",IF(B24=18,\"Besonders\",\"Normal\"))))))))","v":"Normal"}]
["Karmisches Jahr",{"$f":"Jahreskarten!J13","v":1981}]
["Karten der Aufgaben und Gelegenheiten","Persönliche Ziele:",{"$f":"IF($B$24=22,\"As Stäbe\",IF($B$24=1,\"As Stäbe\",IF($B$24=2,\"As Stäbe\",IF($B$24=3,\"2 Stäbe\",IF($B$24=4,\"2 Stäbe\",IF($B$24=5,\"2 Stäbe\",IF($B$24=6,\"3 Stäbe\",IF($B$24=7,\"3 Stäbe\",IF($B$24=8,\"4 Stäbe\",IF($B$24=9,\"4 Stäbe\",IF($B$24=10,\"4 Stäbe\",IF($B$24=11,\"5 Stäbe\",IF($B$24=12,\"5 Stäbe\",IF($B$24=13,\"6 Stäbe\",IF($B$24=14,\"6 Stäbe\",IF($B$24=15,\"6 Stäbe\",IF($B$24=16,\"7 Stäbe\",IF($B$24=17,\"7 Stäbe\",IF($B$24=18,\"7 Stäbe\",IF($B$24=19,\"8 Stäbe\",IF($B$24=20,\"8 Stäbe\",IF($B$24=21,\"9 Stäbe\"))))))))))))))))))))))","v":"4 Stäbe"},{"$f":"IF($B$24=22,\"2 Stäbe\",IF($B$24=1,\"3 Stäbe\",IF($B$24=2,\"6 Stäbe\",IF($B$24=3,\"3 Stäbe\",IF($B$24=4,\"6 Stäbe\",IF($B$24=5,\"4 Stäbe\",IF($B$24=6,\"6 Stäbe\",IF($B$24=7,\"5 Stäbe\",IF($B$24=8,\"5 Stäbe\",IF($B$24=9,\"6 Stäbe\",IF($B$24=10,\"7 Stäbe\",IF($B$24=11,\"6 Stäbe\",IF($B$24=12,\"8 Stäbe\",IF($B$24=13,\"7 Stäbe\",IF($B$24=14,\"9 Stäbe\",IF($B$24=15,\"8 Stäbe\",IF($B$24=16,\"8 Stäbe\",IF($B$24=17,\"9 Stäbe\",IF($B$24=18,\"10 Stäbe\",IF($B$24=19,\"9 Stäbe\",IF($B$24=20,\"10 Stäbe\",IF($B$24=21,\"10 Stäbe\"))))))))))))))))))))))","v":"5 Stäbe"}]
[null,"Beziehung:",{"$f":"IF($B$24=22,\"As Kelche\",IF($B$24=1,\"As Kelche\",IF($B$24=2,\"As Kelche\",IF($B$24=3,\"2 Kelche\",IF($B$24=4,\"2 Kelche\",IF($B$24=5,\"2 Kelche\",IF($B$24=6,\"3 Kelche\",IF($B$24=7,\"3 Kelche\",IF($B$24=8,\"4 Kelche\",IF($B$24=9,\"4 Kelche\",IF($B$24=10,\"4 Kelche\",IF($B$24=11,\"5 Kelche\",IF($B$24=12,\"5 Kelche\",IF($B$24=13,\"6 Kelche\",IF($B$24=14,\"6 Kelche\",IF($B$24=15,\"6 Kelche\",IF($B$24=16,\"7 Kelche\",IF($B$24=17,\"7 Kelche\",IF($B$24=18,\"7 Kelche\",IF($B$24=19,\"8 Kelche\",IF($B$24=20,\"8 Kelche\",IF($B$24=21,\"9 Kelche\"))))))))))))))))))))))","v":"4 Kelche"},{"$f":"IF($B$24=22,\"2 Kelche\",IF($B$24=1,\"3 Kelche\",IF($B$24=2,\"6 Kelche\",IF($B$24=3,\"3 Kelche\",IF($B$24=4,\"6 Kelche\",IF($B$24=5,\"4 Kelche\",IF($B$24=6,\"6 Kelche\",IF($B$24=7,\"5 Kelche\",IF($B$24=8,\"5 Kelche\",IF($B$24=9,\"6 Kelche\",IF($B$24=10,\"7 Kelche\",IF($B$24=11,\"6 Kelche\",IF($B$24=12,\"8 Kelche\",IF($B$24=13,\"7 Kelche\",IF($B$24=14,\"9 Kelche\",IF($B$24=15,\"8 Kelche\",IF($B$24=16,\"8 Kelche\",IF($B$24=17,\"9 Kelche\",IF($B$24=18,\"10 Kelche\",IF($B$24=19,\"9 Kelche\",IF($B$24=20,\"10 Kelche\",IF($B$24=21,\"10 Kelche\"))))))))))))))))))))))","v":"5 Kelche"}]
[null,"Soziales Umfeld:",{"$f":"IF($B$24=22,\"As Schwerter\",IF($B$24=1,\"As Schwerter\",IF($B$24=2,\"As Schwerter\",IF($B$24=3,\"2 Schwerter\",IF($B$24=4,\"2 Schwerter\",IF($B$24=5,\"2 Schwerter\",IF($B$24=6,\"3 Schwerter\",IF($B$24=7,\"3 Schwerter\",IF($B$24=8,\"4 Schwerter\",IF($B$24=9,\"4 Schwerter\",IF($B$24=10,\"4 Schwerter\",IF($B$24=11,\"5 Schwerter\",IF($B$24=12,\"5 Schwerter\",IF($B$24=13,\"6 Schwerter\",IF($B$24=14,\"6 Schwerter\",IF($B$24=15,\"6 Schwerter\",IF($B$24=16,\"7 Schwerter\",IF($B$24=17,\"7 Schwerter\",IF($B$24=18,\"7 Schwerter\",IF($B$24=19,\"8 Schwerter\",IF($B$24=20,\"8 Schwerter\",IF($B$24=21,\"9 Schwerter\"))))))))))))))))))))))","v":"4 Schwerter"},{"$f":"IF($B$24=22,\"2 Schwerter\",IF($B$24=1,\"3 Schwerter\",IF($B$24=2,\"6 Schwerter\",IF($B$24=3,\"3 Schwerter\",IF($B$24=4,\"6 Schwerter\",IF($B$24=5,\"4 Schwerter\",IF($B$24=6,\"6 Schwerter\",IF($B$24=7,\"5 Schwerter\",IF($B$24=8,\"5 Schwerter\",IF($B$24=9,\"6 Schwerter\",IF($B$24=10,\"7 Schwerter\",IF($B$24=11,\"6 Schwerter\",IF($B$24=12,\"8 Schwerter\",IF($B$24=13,\"7 Schwerter\",IF($B$24=14,\"9 Schwerter\",IF($B$24=15,\"8 Schwerter\",IF($B$24=16,\"8 Schwerter\",IF($B$24=17,\"9 Schwerter\",IF($B$24=18,\"10 Schwerter\",IF($B$24=19,\"9 Schwerter\",IF($B$24=20,\"10 Schwerter\",IF($B$24=21,\"10 Schwerter\"))))))))))))))))))))))","v":"5 Schwerter"}]
[null,"Beruf, Geld:",{"$f":"IF($B$24=22,\"As Münzen\",IF($B$24=1,\"As Münzen\",IF($B$24=2,\"As Münzen\",IF($B$24=3,\"2 Münzen\",IF($B$24=4,\"2 Münzen\",IF($B$24=5,\"2 Münzen\",IF($B$24=6,\"3 Münzen\",IF($B$24=7,\"3 Münzen\",IF($B$24=8,\"4 Münzen\",IF($B$24=9,\"4 Münzen\",IF($B$24=10,\"4 Münzen\",IF($B$24=11,\"5 Münzen\",IF($B$24=12,\"5 Münzen\",IF($B$24=13,\"6 Münzen\",IF($B$24=14,\"6 Münzen\",IF($B$24=15,\"6 Münzen\",IF($B$24=16,\"7 Münzen\",IF($B$24=17,\"7 Münzen\",IF($B$24=18,\"7 Münzen\",IF($B$24=19,\"8 Münzen\",IF($B$24=20,\"8 Münzen\",IF($B$24=21,\"9 Münzen\"))))))))))))))))))))))","v":"4 Münzen"},{"$f":"IF($B$24=22,\"2 Münzen\",IF($B$24=1,\"3 Münzen\",IF($B$24=2,\"6 Münzen\",IF($B$24=3,\"3 Münzen\",IF($B$24=4,\"6 Münzen\",IF($B$24=5,\"4 Münzen\",IF($B$24=6,\"6 Münzen\",IF($B$24=7,\"5 Münzen\",IF($B$24=8,\"5 Münzen\",IF($B$24=9,\"6 Münzen\",IF($B$24=10,\"7 Münzen\",IF($B$24=11,\"6 Münzen\",IF($B$24=12,\"8 Münzen\",IF($B$24=13,\"7 Münzen\",IF($B$24=14,\"9 Münzen\",IF($B$24=15,\"8 Münzen\",IF($B$24=16,\"8 Münzen\",IF($B$24=17,\"9 Münzen\",IF($B$24=18,\"10 Münzen\",IF($B$24=19,\"9 Münzen\",IF($B$24=20,\"10 Münzen\",IF($B$24=21,\"10 Münzen\"))))))))))))))))))))))","v":"5 Münzen"}]
["Konstellation der Jahreskarte",{"$f":"IF(OR(B24=1,B24=10,B24=19),\"1 Der Magier\",IF(OR(B24=2,B24=11,B24=20),\"2 Die Hohepriesterin\",IF(OR(B24=3,B24=12,B24=21),\"3 Die Herrscherin\",IF(OR(B24=4,B24=13,B24=22),\"4 Der Herrscher\",IF(OR(B24=5,B24=14),\"5 Der Hierophant\",IF(OR(B24=6,B24=15),\"6 Die Liebenden\",IF(OR(B24=7,B24=16),\"7 DerWagen\",IF(OR(B24=8,B24=17),\"8 Die Kraft\",IF(OR(B24=9,B24=18),\"9 Der Eremit\")))))))))","v":"8 Die Kraft"}]
["Gruppe der Jahreskarte",{"$f":"IF(OR(B24=1,B24=4,B24=7,B24=10,B24=13,B24=16,B24=19,B24=22),\"Osiris\",IF(OR(B24=2,B24=5,B24=8,B24=11,B24=14,B24=17,B24=20),\"Isis\",IF(OR(B24=3,B24=6,B24=9,B24=12,B24=15,B24=18,B24=21),\"Horus\")))","v":"Isis"}]
["Die Jahreskarte entspricht der Persönlichkeitskarte",{"$f":"IF(B24=B6,\"Ja\",\"Nein\")","v":"Nein"}]
["Die Jahreskarte entspricht der Wesenskarte",{"$f":"IF(B24=B7,\"Ja\",\"Nein\")","v":"Nein"}]
["Die Jahreskarte entspricht der zweiten Wesenskarte",{"$f":"IF(B24=B8,\"Ja\",\"Nein\")","v":"Nein"}]
["Grundthema des aktuellen Zyklus","Erstes Jahr im Zyklus"]
["Die Jahreskarten im Leben","Siehe bei \"Jahreskarten\""]
["In welchen Jahren tauchen neue Karten auf?","Siehe bei \"Jahreskarten\""]
["In welchen Jahren fallen Karten für immer weg?","Siehe bei \"Jahreskarten\""]
["Beginn des nächsten Lebenszyklus","Siehe bei \"Jahreskarten\""]

{"sheet":"Numerologie 2","index":7,"n_rows":131,"n_cols":28,"rows_kept":131,"cut":false,"hidden":false,"merged":[]}
["Die Berechnungen der Namensanalyse","für",{"$f":"Jahreskarten!E8","v":"Zum "},{"$f":"Jahreskarten!F8","v":"Beispiel"}]
["Bitte denken Sie daran, dass der Buchstabe \"Y\" ein Vokal oder ein Konsonant sein kann. In Xylophon, Marley oder Mary ist es ein Vokal. Er wird als ü oder i gesprochen."]
["In Yoga, Beyoncé oder Yak ist es ein Konsonant. Dann wird das Y als J gesprochen. Wenn das Y im Namen ein Vokal ist, schreiben Sie es wie gewohnt als y. "]
["Wenn das Y aber ein Konsonant ist, dann tragen Sie im Namen \"$\" ein. So kann das Programm erkennen, ob es sich um einen Vokal oder einen Konsonanten handelt. Z.B. Yara = $ara."]
["Schreiben Sie das scharfe S (β) immer als doppeltes S. Statt Straβe schreiben Sie also Strasse. Französische Akzente wie é, è oder ë lassen Sie weg, genauso wie die Tilde bei ñ. Sie verändern den Buchstabenwert nicht."]
["Die Umläute ä, ö und ü schreiben Sie ganz normal. "]
["Falls Sie mehrere mittlere Namen haben, schreiben Sie diese alle zusammen. Z.B. Susanne Margarete = Susannemargarete. Auch Namenszusätze wie \"von\" oder \"de\" sollten zusammengeschrieben werden. Z.B. von Kleist = vonkleist."]
[]
[null,"Jahr","Monat","Tag",null,"Summe","Quersumme","Karte"]
["Geben Sie auf dem Blatt \"Jahreskarten\" Ihr Geburtsdatum ein:",{"$f":"Jahreskarten!A8","v":1962},{"$f":"Jahreskarten!B8","v":7},{"$f":"Jahreskarten!C8","v":12},null,null,null,null,null,null,null,null,"Stelle","Vorname","Wert","Stelle","Mittlere Namen","Wert","Stelle","Nachname","Wert","Vokale Vornamen","Vokale mittlere Namen","Vokale Nachnamen","Konsonanten Vornamen","Konsonanten mittlere Namen","Konsonanten Nachnamen"]
[null,null,"Buchstabenwerte","Anzahl Buchstaben",null,null,null,null,null,null,"a",1,1,{"$f":"IF(MID($B$12,M11,1)=\"\",\" \",MID($B$12,M11,1))","v":"m"},{"$f":"IF(ISERROR(VLOOKUP(N11,$K$11:$L$40,2,FALSE)),0,VLOOKUP(N11,$K$11:$L$40,2,FALSE))","v":13},1,{"$f":"IF(MID($B$13,P11,1)=\"\",\" \",MID($B$13,P11,1))","v":" "},{"$f":"IF(ISERROR(VLOOKUP(Q11,$K$11:$L$40,2,FALSE)),0,VLOOKUP(Q11,$K$11:$L$40,2,FALSE))","v":0},1,{"$f":"IF(MID($B$14,S11,1)=\"\",\" \",MID($B$14,S11,1))","v":"t"},{"$f":"IF(ISERROR(VLOOKUP(T11,$K$11:$L$40,2,FALSE)),0,VLOOKUP(T11,$K$11:$L$40,2,FALSE))","v":20},{"$f":"IF(N11=\"a\",1,IF(N11=\"e\",5,IF(N11=\"i\",9,IF(N11=\"o\",15,IF(N11=\"u\",21,IF(N11=\"y\",25,IF(N11=\"ä\",1,IF(N11=\"ö\",15,IF(N11=\"ü\",21,0)))))))))","v":0},{"$f":"IF(Q11=\"a\",1,IF(Q11=\"e\",5,IF(Q11=\"i\",9,IF(Q11=\"o\",15,IF(Q11=\"u\",21,IF(Q11=\"y\",25,IF(Q11=\"ä\",1,IF(Q11=\"ö\",15,IF(Q11=\"ü\",21,0)))))))))","v":0},{"$f":"IF(T11=\"a\",1,IF(T11=\"e\",5,IF(T11=\"i\",9,IF(T11=\"o\",15,IF(T11=\"u\",21,IF(T11=\"y\",25,IF(T11=\"ä\",1,IF(T11=\"ö\",15,IF(T11=\"ü\",21,0)))))))))","v":0},{"$f":"IF(N11=\"a\",0,IF(N11=\"b\",2,IF(N11=\"c\",3,IF(N11=\"d\",4,IF(N11=\"e\",0,IF(N11=\"f\",6,IF(N11=\"g\",7,IF(N11=\"h\",8,IF(N11=\"i\",0,IF(N11=\"j\",10,IF(N11=\"k\",11,IF(N11=\"l\",12,IF(N11=\"m\",13,IF(N11=\"n\",14,IF(N11=\"o\",0,IF(N11=\"p\",16,IF(N11=\"q\",17,IF(N11=\"r\",18,IF(N11=\"s\",19,IF(N11=\"t\",20,IF(N11=\"u\",0,IF(N11=\"v\",22,IF(N11=\"w\",23,IF(N11=\"x\",24,IF(N11=\"y\",0,IF(N11=\"$\",25,IF(N11=\"z\",26,0)))))))))))))))))))))))))))","v":13},{"$f":"IF(Q11=\"a\",0,IF(Q11=\"b\",2,IF(Q11=\"c\",3,IF(Q11=\"d\",4,IF(Q11=\"e\",0,IF(Q11=\"f\",6,IF(Q11=\"g\",7,IF(Q11=\"h\",8,IF(Q11=\"i\",0,IF(Q11=\"j\",10,IF(Q11=\"k\",11,IF(Q11=\"l\",12,IF(Q11=\"m\",13,IF(Q11=\"n\",14,IF(Q11=\"o\",0,IF(Q11=\"p\",16,IF(Q11=\"q\",17,IF(Q11=\"r\",18,IF(Q11=\"s\",19,IF(Q11=\"t\",20,IF(Q11=\"u\",0,IF(Q11=\"v\",22,IF(Q11=\"w\",23,IF(Q11=\"x\",24,IF(Q11=\"y\",0,IF(Q11=\"$\",25,IF(Q11=\"z\",26,0)))))))))))))))))))))))))))","v":0},{"$f":"IF(T11=\"a\",0,IF(T11=\"b\",2,IF(T11=\"c\",3,IF(T11=\"d\",4,IF(T11=\"e\",0,IF(T11=\"f\",6,IF(T11=\"g\",7,IF(T11=\"h\",8,IF(T11=\"i\",0,IF(T11=\"j\",10,IF(T11=\"k\",11,IF(T11=\"l\",12,IF(T11=\"m\",13,IF(T11=\"n\",14,IF(T11=\"o\",0,IF(T11=\"p\",16,IF(T11=\"q\",17,IF(T11=\"r\",18,IF(T11=\"s\",19,IF(T11=\"t\",20,IF(T11=\"u\",0,IF(T11=\"v\",22,IF(T11=\"w\",23,IF(T11=\"x\",24,IF(T11=\"y\",0,IF(T11=\"$\",25,IF(T11=\"z\",26,0)))))))))))))))))))))))))))","v":20}]
["Vorname","maria",{"$f":"O41","v":42},{"$f":"LEN(B12)","v":5},null,{"$f":"C12","v":42},{"$f":"IF(F12>22,SUMPRODUCT(VALUE(MID(F12,ROW(INDIRECT(\"$b1:$A\"&LEN(F12))),1))),F12)","v":6},{"$f":"IF(G12>22,SUMPRODUCT(VALUE(MID(G12,ROW(INDIRECT(\"$b1:$A\"&LEN(G12))),1))),G12)","v":6},null,null,"ä",1,2,{"$f":"IF(MID($B$12,M12,1)=\"\",\" \",MID($B$12,M12,1))","v":"a"},1,2,{"$f":"IF(MID($B$13,P12,1)=\"\",\" \",MID($B$13,P12,1))","v":" "},0,2,{"$f":"IF(MID($B$14,S12,1)=\"\",\" \",MID($B$14,S12,1))","v":"i"},9,{"$f":"IF(N12=\"a\",1,IF(N12=\"e\",5,IF(N12=\"i\",9,IF(N12=\"o\",15,IF(N12=\"u\",21,IF(N12=\"y\",25,IF(N12=\"ä\",1,IF(N12=\"ö\",15,IF(N12=\"ü\",21,0)))))))))","v":1},{"$f":"IF(Q12=\"a\",1,IF(Q12=\"e\",5,IF(Q12=\"i\",9,IF(Q12=\"o\",15,IF(Q12=\"u\",21,IF(Q12=\"y\",25,IF(Q12=\"ä\",1,IF(Q12=\"ö\",15,IF(Q12=\"ü\",21,0)))))))))","v":0},{"$f":"IF(T12=\"a\",1,IF(T12=\"e\",5,IF(T12=\"i\",9,IF(T12=\"o\",15,IF(T12=\"u\",21,IF(T12=\"y\",25,IF(T12=\"ä\",1,IF(T12=\"ö\",15,IF(T12=\"ü\",21,0)))))))))","v":9},{"$f":"IF(N12=\"a\",0,IF(N12=\"b\",2,IF(N12=\"c\",3,IF(N12=\"d\",4,IF(N12=\"e\",0,IF(N12=\"f\",6,IF(N12=\"g\",7,IF(N12=\"h\",8,IF(N12=\"i\",0,IF(N12=\"j\",10,IF(N12=\"k\",11,IF(N12=\"l\",12,IF(N12=\"m\",13,IF(N12=\"n\",14,IF(N12=\"o\",0,IF(N12=\"p\",16,IF(N12=\"q\",17,IF(N12=\"r\",18,IF(N12=\"s\",19,IF(N12=\"t\",20,IF(N12=\"u\",0,IF(N12=\"v\",22,IF(N12=\"w\",23,IF(N12=\"x\",24,IF(N12=\"y\",0,IF(N12=\"$\",25,IF(N12=\"z\",26,0)))))))))))))))))))))))))))","v":0},{"$f":"IF(Q12=\"a\",0,IF(Q12=\"b\",2,IF(Q12=\"c\",3,IF(Q12=\"d\",4,IF(Q12=\"e\",0,IF(Q12=\"f\",6,IF(Q12=\"g\",7,IF(Q12=\"h\",8,IF(Q12=\"i\",0,IF(Q12=\"j\",10,IF(Q12=\"k\",11,IF(Q12=\"l\",12,IF(Q12=\"m\",13,IF(Q12=\"n\",14,IF(Q12=\"o\",0,IF(Q12=\"p\",16,IF(Q12=\"q\",17,IF(Q12=\"r\",18,IF(Q12=\"s\",19,IF(Q12=\"t\",20,IF(Q12=\"u\",0,IF(Q12=\"v\",22,IF(Q12=\"w\",23,IF(Q12=\"x\",24,IF(Q12=\"y\",0,IF(Q12=\"$\",25,IF(Q12=\"z\",26,0)))))))))))))))))))))))))))","v":0},{"$f":"IF(T12=\"a\",0,IF(T12=\"b\",2,IF(T12=\"c\",3,IF(T12=\"d\",4,IF(T12=\"e\",0,IF(T12=\"f\",6,IF(T12=\"g\",7,IF(T12=\"h\",8,IF(T12=\"i\",0,IF(T12=\"j\",10,IF(T12=\"k\",11,IF(T12=\"l\",12,IF(T12=\"m\",13,IF(T12=\"n\",14,IF(T12=\"o\",0,IF(T12=\"p\",16,IF(T12=\"q\",17,IF(T12=\"r\",18,IF(T12=\"s\",19,IF(T12=\"t\",20,IF(T12=\"u\",0,IF(T12=\"v\",22,IF(T12=\"w\",23,IF(T12=\"x\",24,IF(T12=\"y\",0,IF(T12=\"$\",25,IF(T12=\"z\",26,0)))))))))))))))))))))))))))","v":0}]
["Alle mittleren Namen",null,{"$f":"R41","v":0},{"$f":"LEN(B13)","v":0},null,{"$f":"C13","v":0},{"$f":"IF(F13>22,SUMPRODUCT(VALUE(MID(F13,ROW(INDIRECT(\"$b1:$A\"&LEN(F13))),1))),F13)","v":0},{"$f":"IF(G13>22,SUMPRODUCT(VALUE(MID(G13,ROW(INDIRECT(\"$b1:$A\"&LEN(G13))),1))),G13)","v":0},null,null,"b",2,3,"r",18,3," ",0,3,"k",11,0,0,0,18,0,11]
["Nachname","tikhonova",{"$f":"U41","v":115},9,null,115,7,7,null,null,"c",3,4,"i",9,4," ",0,4,"h",8,9,0,0,0,0,8]
[null,null,{"$f":"SUM(C12:C14)","v":157},{"$f":"SUM(D12:D14)","v":14},null,157,13,13,null,null,"d",4,5,"a",1,5," ",0,5,"o",15,1,0,15,0,0,0]
["Ersten Buchstaben des Vornamens eingeben","m",null,null,null,{"$f":"D10","v":12},12,12,null,null,"e",5,6," ",0,6," ",0,6,"n",14,0,0,0,0,0,14]
["Ersten Vokal des Vornamens eingeben","a",null,null,null,{"$f":"SUM(B10+C10+D10)","v":1981},19,19,null,null,"f",6,7,{"$f":"IF(MID($B$12,M17,1)=\"\",\" \",MID($B$12,M17,1))","v":" "},0,7," ",0,7,"o",15,0,0,15,0,0,0]
[null,null,null,null,null,{"$f":"SUM(C15+F17)","v":2138},14,14,null,null,"g",7,8," ",0,8," ",0,8,"v",22,0,0,0,0,0,22]
[null,null,null,null,null,{"$f":"X42","v":51},6,6,null,null,"h",8,9," ",0,9," ",0,9,"a",1,0,0,1,0,0,0]
["Die numerologischen Karten","Nr.","Karte","Konstellation","Gruppe",{"$f":"AA42","v":106},7,7,null,null,"i",9,10," ",0,10," ",0,10," ",0,0,0,0,0,0,0]
["Die Seelenkarte (Summe aller Vokale)",{"$f":"H19","v":6},{"$f":"IF(B21=1,\"Der Magier\",IF(B21=2,\"Die Hohepriesterin\",IF(B21=3,\"Die Herrscherin\",IF(B21=4,\"Der Herrscher\",IF(B21=5,\"Der Hierophant\",IF(B21=6,\"Die Liebenden\",IF(B21=7,\"Der Wagen\",IF(B21=8,\"Die Kraft\",IF(B21=9,\"Der Eremit\",IF(B21=10,\"Das Rad\",IF(B21=11,\"Die Gerechtigkeit\",IF(B21=12,\"Der Gehängte\",IF(B21=13,\"Der Tod\",IF(B21=14,\"Die Mässigkeit\",IF(B21=15,\"Der Teufel\",IF(B21=16,\"Der Turm\",IF(B21=17,\"Der Stern\",IF(B21=18,\"Der Mond\",IF(B21=19,\"Die Sonne\",IF(B21=20,\"Das Gericht\",IF(B21=21,\"Die Welt\",IF(B21=22,\"Der Narr\"))))))))))))))))))))))","v":"Die Liebenden"},{"$f":"IF(OR(B21=1,B21=10,B21=19),\"1 Der Magier\",IF(OR(B21=2,B21=11,B21=20),\"2 Die Hohepriesterin\",IF(OR(B21=3,B21=12,B21=21),\"3 Die Herrscherin\",IF(OR(B21=4,B21=13,B21=22),\"4 Der Herrscher\",IF(OR(B21=5,B21=14),\"5 Der Hierophant\",IF(OR(B21=6,B21=15),\"6 Die Liebenden\",IF(OR(B21=7,B21=16),\"7 DerWagen\",IF(OR(B21 =8,B21=17),\"8 Die Kraft\",IF(OR(B21=9,B21=18),\"9 Der Eremit\")))))))))","v":"6 Die Liebenden"},{"$f":"IF(OR(B21=1,B21=4,B21=7,B21=10,B21=13,B21=16,B21=19,B21=22),\"Osiris\",IF(OR(B21=2,B21=5,B21=8,B21=11,B21=14,B21=17,B21=20),\"Isis\",IF(OR(B21=3,B21=6,B21=9,B21=12,B21=15,B21=18,B21=21),\"Horus\")))","v":"Horus"},{"$f":"(MOD(B21-TRUNC(B21/9)*9,-9)+9)*(B21>0)","v":6},null,null,null,null,"j",10,11," ",0,11," ",0,11," ",0,0,0,0,0,0,0]
["Die Karte der Persönlichkeit (Summe aller Konsonanten)",{"$f":"H20","v":7},"Der Wagen","7 DerWagen","Osiris",{"$f":"(MOD(B22-TRUNC(B22/9)*9,-9)+9)*(B22>0)","v":7},null,null,null,null,"k",11,12," ",0,12," ",0,12," ",0,0,0,0,0,0,0]
["Die Schicksalskarte (Zahlen des gesamten Namens)",{"$f":"H15","v":13},"Der Tod","4 Der Herrscher","Osiris",4,null,null,null,null,"l",12,13," ",0,13," ",0,13," ",0,0,0,0,0,0,0]
["Die Geburtstagskarte (Tag der Geburt)",{"$f":"H16","v":12},"Der Gehängte","3 Die Herrscherin","Horus",3,null,null,null,null,"m",13,14," ",0,14," ",0,14," ",0,0,0,0,0,0,0]
["Die Persönlichkeitskarte (Geburtsdatum)",{"$f":"H17","v":19},"Die Sonne","1 Der Magier","Osiris",1,null,null,null,null,"n",14,15," ",0,15," ",0,15," ",0,0,0,0,0,0,0]
["Das individuelle Selbst (Rufname)",{"$f":"H12","v":6},"Die Liebenden","6 Die Liebenden","Horus",6,null,null,null,null,"o",15,16," ",0,16," ",0,16," ",0,0,0,0,0,0,0]
["Das verborgene Selbst (alle mittleren Namen)",{"$f":"H13","v":0},{"$f":"IF(B27=1,\"Der Magier\",IF(B27=2,\"Die Hohepriesterin\",IF(B27=3,\"Die Herrscherin\",IF(B27=4,\"Der Herrscher\",IF(B27=5,\"Der Hierophant\",IF(B27=6,\"Die Liebenden\",IF(B27=7,\"Der Wagen\",IF(B27=8,\"Die Kraft\",IF(B27=9,\"Der Eremit\",IF(B27=10,\"Das Rad\",IF(B27=11,\"Die Gerechtigkeit\",IF(B27=12,\"Der Gehängte\",IF(B27=13,\"Der Tod\",IF(B27=14,\"Die Mässigkeit\",IF(B27=15,\"Der Teufel\",IF(B27=16,\"Der Turm\",IF(B27=17,\"Der Stern\",IF(B27=18,\"Der Mond\",IF(B27=19,\"Die Sonne\",IF(B27=20,\"Das Gericht\",IF(B27=21,\"Die Welt\",IF(B27=22,\"Der Narr\",0))))))))))))))))))))))","v":0},{"$f":"IF(OR(B27=1,B27=10,B27=19),\"1 Der Magier\",IF(OR(B27=2,B27=11,B27=20),\"2 Die Hohepriesterin\",IF(OR(B27=3,B27=12,B27=21),\"3 Die Herrscherin\",IF(OR(B27=4,B27=13,B27=22),\"4 Der Herrscher\",IF(OR(B27=5,B27=14),\"5 Der Hierophant\",IF(OR(B27=6,B27=15),\"6 Die Liebenden\",IF(OR(B27=7,B27=16),\"7 DerWagen\",IF(OR(B27 =8,B27=17),\"8 Die Kraft\",IF(OR(B27=9,B27=18),\"9 Der Eremit\",0)))))))))","v":0},{"$f":"IF(OR(B27=1,B27=4,B27=7,B27=10,B27=13,B27=16,B27=19,B27=22),\"Osiris\",IF(OR(B27=2,B27=5,B27=8,B27=11,B27=14,B27=17,B27=20),\"Isis\",IF(OR(B27=3,B27=6,B27=9,B27=12,B27=15,B27=18,B27=21),\"Horus\",0)))","v":0},0,null,null,null,null,"ö",15,17," ",0,17," ",0,17," ",0,0,0,0,0,0,0]
["Das soziale Selbst (Nachname)",{"$f":"H14","v":7},{"$f":"IF(B28=1,\"Der Magier\",IF(B28=2,\"Die Hohepriesterin\",IF(B28=3,\"Die Herrscherin\",IF(B28=4,\"Der Herrscher\",IF(B28=5,\"Der Hierophant\",IF(B28=6,\"Die Liebenden\",IF(B28=7,\"Der Wagen\",IF(B28=8,\"Die Kraft\",IF(B28=9,\"Der Eremit\",IF(B28=10,\"Das Rad\",IF(B28=11,\"Die Gerechtigkeit\",IF(B28=12,\"Der Gehängte\",IF(B28=13,\"Der Tod\",IF(B28=14,\"Die Mässigkeit\",IF(B28=15,\"Der Teufel\",IF(B28=16,\"Der Turm\",IF(B28=17,\"Der Stern\",IF(B28=18,\"Der Mond\",IF(B28=19,\"Die Sonne\",IF(B28=20,\"Das Gericht\",IF(B28=21,\"Die Welt\",IF(B28=22,\"Der Narr\"))))))))))))))))))))))","v":"Der Wagen"},{"$f":"IF(OR(B28=1,B28=10,B28=19),\"1 Der Magier\",IF(OR(B28=2,B28=11,B28=20),\"2 Die Hohepriesterin\",IF(OR(B28=3,B28=12,B28=21),\"3 Die Herrscherin\",IF(OR(B28=4,B28=13,B28=22),\"4 Der Herrscher\",IF(OR(B28=5,B28=14),\"5 Der Hierophant\",IF(OR(B28=6,B28=15),\"6 Die Liebenden\",IF(OR(B28=7,B28=16),\"7 DerWagen\",IF(OR(B28 =8,B28=17),\"8 Die Kraft\",IF(OR(B28=9,B28=18),\"9 Der Eremit\")))))))))","v":"7 DerWagen"},{"$f":"IF(OR(B28=1,B28=4,B28=7,B28=10,B28=13,B28=16,B28=19,B28=22),\"Osiris\",IF(OR(B28=2,B28=5,B28=8,B28=11,B28=14,B28=17,B28=20),\"Isis\",IF(OR(B28=3,B28=6,B28=9,B28=12,B28=15,B28=18,B28=21),\"Horus\")))","v":"Osiris"},7,null,null,null,null,"p",16,18," ",0,18," ",0,18," ",0,0,0,0,0,0,0]
["Das Lebenspotential (Geburtsdatum und Namen)",{"$f":"H18","v":14},"Die Mässigkeit","5 Der Hierophant","Isis",5,null,null,null,null,"q",17,19," ",0,19," ",0,19," ",0,0,0,0,0,0,0]
["Die Karte des ersten Buchstabens",{"$f":"VLOOKUP(B16,A106:E131,2,FALSE)","v":13},{"$f":"VLOOKUP($B$16,$A$106:$E$131,3,FALSE)","v":"Der Tod"},{"$f":"VLOOKUP($B$16,$A$106:$E$131,4,FALSE)","v":"4 Der Herrscher"},{"$f":"VLOOKUP(B16,A106:E131,5,FALSE)","v":"Osiris"},4,null,null,null,null,"r",18,20,null,{"$f":"IF(ISERROR(VLOOKUP(N32,$K$11:$L$40,2,FALSE)),0,VLOOKUP(N32,$K$11:$L$40,2,FALSE))","v":0},20,null,{"$f":"IF(ISERROR(VLOOKUP(Q32,$K$11:$L$40,2,FALSE)),0,VLOOKUP(Q32,$K$11:$L$40,2,FALSE))","v":0},20,null,{"$f":"IF(ISERROR(VLOOKUP(T32,$K$11:$L$40,2,FALSE)),0,VLOOKUP(T32,$K$11:$L$40,2,FALSE))","v":0},{"$f":"IF(N32=\"a\",1,IF(N32=\"e\",5,IF(N32=\"i\",9,IF(N32=\"o\",15,IF(N32=\"u\",21,IF(N32=\"y\",25,IF(N32=\"ä\",1,IF(N32=\"ö\",15,IF(N32=\"ü\",21,0)))))))))","v":0},{"$f":"IF(Q32=\"a\",1,IF(Q32=\"e\",5,IF(Q32=\"i\",9,IF(Q32=\"o\",15,IF(Q32=\"u\",21,IF(Q32=\"y\",25,IF(Q32=\"ä\",1,IF(Q32=\"ö\",15,IF(Q32=\"ü\",21,0)))))))))","v":0},{"$f":"IF(T32=\"a\",1,IF(T32=\"e\",5,IF(T32=\"i\",9,IF(T32=\"o\",15,IF(T32=\"u\",21,IF(T32=\"y\",25,IF(T32=\"ä\",1,IF(T32=\"ö\",15,IF(T32=\"ü\",21,0)))))))))","v":0},{"$f":"IF(N32=\"a\",0,IF(N32=\"b\",2,IF(N32=\"c\",3,IF(N32=\"d\",4,IF(N32=\"e\",0,IF(N32=\"f\",6,IF(N32=\"g\",7,IF(N32=\"h\",8,IF(N32=\"i\",0,IF(N32=\"j\",10,IF(N32=\"k\",11,IF(N32=\"l\",12,IF(N32=\"m\",13,IF(N32=\"n\",14,IF(N32=\"o\",0,IF(N32=\"p\",16,IF(N32=\"q\",17,IF(N32=\"r\",18,IF(N32=\"s\",19,IF(N32=\"t\",20,IF(N32=\"u\",0,IF(N32=\"v\",22,IF(N32=\"w\",23,IF(N32=\"x\",24,IF(N32=\"y\",0,IF(N32=\"$\",25,IF(N32=\"z\",26,0)))))))))))))))))))))))))))","v":0},{"$f":"IF(Q32=\"a\",0,IF(Q32=\"b\",2,IF(Q32=\"c\",3,IF(Q32=\"d\",4,IF(Q32=\"e\",0,IF(Q32=\"f\",6,IF(Q32=\"g\",7,IF(Q32=\"h\",8,IF(Q32=\"i\",0,IF(Q32=\"j\",10,IF(Q32=\"k\",11,IF(Q32=\"l\",12,IF(Q32=\"m\",13,IF(Q32=\"n\",14,IF(Q32=\"o\",0,IF(Q32=\"p\",16,IF(Q32=\"q\",17,IF(Q32=\"r\",18,IF(Q32=\"s\",19,IF(Q32=\"t\",20,IF(Q32=\"u\",0,IF(Q32=\"v\",22,IF(Q32=\"w\",23,IF(Q32=\"x\",24,IF(Q32=\"y\",0,IF(Q32=\"$\",25,IF(Q32=\"z\",26,0)))))))))))))))))))))))))))","v":0},{"$f":"IF(T32=\"a\",0,IF(T32=\"b\",2,IF(T32=\"c\",3,IF(T32=\"d\",4,IF(T32=\"e\",0,IF(T32=\"f\",6,IF(T32=\"g\",7,IF(T32=\"h\",8,IF(T32=\"i\",0,IF(T32=\"j\",10,IF(T32=\"k\",11,IF(T32=\"l\",12,IF(T32=\"m\",13,IF(T32=\"n\",14,IF(T32=\"o\",0,IF(T32=\"p\",16,IF(T32=\"q\",17,IF(T32=\"r\",18,IF(T32=\"s\",19,IF(T32=\"t\",20,IF(T32=\"u\",0,IF(T32=\"v\",22,IF(T32=\"w\",23,IF(T32=\"x\",24,IF(T32=\"y\",0,IF(T32=\"$\",25,IF(T32=\"z\",26,0)))))))))))))))))))))))))))","v":0}]
["Die Karte des ersten Vokals",{"$f":"VLOOKUP($B$17,$A$106:$E$131,2,FALSE)","v":1},{"$f":"VLOOKUP($B$17,$A$106:$E$131,3,FALSE)","v":"Der Magier"},{"$f":"VLOOKUP($B$17,$A$106:$E$131,4,FALSE)","v":"1 Der Magier"},{"$f":"VLOOKUP($B$17,$A$106:$E$131,5,FALSE)","v":"Osiris"},1,null,null,null,null,"s",19,21,null,0,21,null,0,21,null,0,0,0,0,0,0,0]
[null,null,null,null,null,null,null,null,null,null,"t",20,22,{"$f":"IF(MID($B$12,M30,1)=\"\",\" \",MID($B$12,M30,1))","v":" "},0,22,{"$f":"IF(MID($B$13,P30,1)=\"\",\" \",MID($B$13,P30,1))","v":" "},0,22,{"$f":"IF(MID($B$14,S30,1)=\"\",\" \",MID($B$14,S30,1))","v":" "},0,0,0,0,0,0,0]
[null,null,null,null,null,null,null,null,null,null,"u",21,23," ",0,23," ",0,23," ",0,0,0,0,0,0,0]
[null,"Jahr","Monat","Tag",null,null,null,null,null,null,"ü",21,24," ",0,24," ",0,24," ",0,0,0,0,0,0,0]
["Wichtiger Termin",2021,11,19,{"$f":"SUM(B35:D35)","v":2051},{"$f":"SUMPRODUCT(MID(E35,ROW(INDIRECT(\"1:\"&LEN(E35))),1)*1)","v":8},{"$f":"IF(F35>22,SUMPRODUCT(VALUE(MID(F35,ROW(INDIRECT(\"$b1:$A\"&LEN(F35))),1))),F35)","v":8},null,null,null,"v",22,25," ",0,25," ",0,25," ",0,0,0,0,0,0,0]
[null,null,null,null,null,null,null,null,null,null,"w",23,26," ",0,26," ",0,26," ",0,0,0,0,0,0,0]
[null,null,null,null,null,null,null,null,null,null,"x",24,27," ",0,27," ",0,27," ",0,0,0,0,0,0,0]
["Die Häufigkeit der Karten","Menge","Konstellationen","Summe","Gruppen","Summe",null,null,null,null,"y",25,28," ",0,28," ",0,28," ",0,0,0,0,0,0,0]
["1 Der Magier",{"$f":"V45","v":3},"1 Der Magier",{"$f":"SUM(B39+B48+B57)","v":3},"Osiris",{"$f":"SUM(B39+B42+B45+B48+B51+B54+B57+B60)","v":5},null,null,null,null,"$",25,29," ",0,29," ",0,29," ",0,0,0,0,0,0,0]
["2 Die Hohepriesterin",{"$f":"V46","v":0},"2 Die Hohepriesterin",{"$f":"SUM(B40+B49+B58)","v":2},"Isis",{"$f":"SUM(B40+B43+B46+B49+B52+B55+B58)","v":4},null,null,null,null,"z",26,30," ",0,30," ",0,30," ",0,0,0,0,0,0,0]
["3 Die Herrscherin",{"$f":"V47","v":0},"3 Die Herrscherin",{"$f":"SUM(B41+B50+B59)","v":0},"Horus",{"$f":"SUM(B41+B44+B47+B50+B53+B56+B59)","v":5},null,null,null,null,null,null,null," ",{"$f":"SUM(O11:O40)","v":42},null," ",{"$f":"SUM(R11:R40)","v":0},null," ",{"$f":"SUM(U11:U40)","v":115},11,0,40,31,0,75]
["4 Der Herrscher",0,"4 Der Herrscher",{"$f":"SUM(B42+B51+B60)","v":2},"Osiris",{"$f":"SUM(F39:F41)","v":14},null,null,null,null,null,null,null," ",null,null," ",null,null," ",null,null,"Summe aller Vokale",{"$f":"SUM(V41+W41+X41)","v":51},null,"Summe aller Konsonanten",{"$f":"SUM(Y41+Z41+AA41)","v":106}]
["5 Der Hierophant",0,"5 Der Hierophant",{"$f":"SUM(B43+B52)","v":1},"Isis"]
["6 Die Liebenden",0,"6 Die Liebenden",{"$f":"SUM(B44+B53)","v":2},"Horus"]
["7 Der Wagen",0,"7 Der Wagen",{"$f":"SUM(B45+B54)","v":0},"Osiris",null,null,null,null,null,null,null,null,"1 Der Magier",{"$f":"COUNTIF($O$11:$O$40,1)","v":2},0,0,{"$f":"COUNTIF($R$11:$R$40,1)","v":0},0,0,{"$f":"COUNTIF($U$11:$U$40,1)","v":1},{"$f":"SUM(O45:U45)","v":3}]
["8 Die Kraft",1,"8 Die Kraft",{"$f":"SUM(B46+B55)","v":1},"Isis",null,null,null,null,null,null,null,null,"2 Die Hohepriesterin",{"$f":"COUNTIF($O$11:$O$40,2)","v":0},0,0,{"$f":"COUNTIF($R$11:$R$40,2)","v":0},0,0,{"$f":"COUNTIF($U$11:$U$40,2)","v":0},{"$f":"SUM(O46:U46)","v":0}]
["9 Der Eremit",2,"9 Der Eremit",{"$f":"SUM(B47+B56)","v":3},"Horus",null,null,null,null,null,null,null,null,"3 Die Herrscherin",{"$f":"COUNTIF($O$11:$O$40,3)","v":0},0,0,{"$f":"COUNTIF($R$11:$R$40,3)","v":0},0,0,{"$f":"COUNTIF($U$11:$U$40,3)","v":0},{"$f":"SUM(O47:U47)","v":0}]
["10 Das Rad des Schicksals",0,"1 Der Magier",{"$f":"SUM(D39:D47)","v":14},"Osiris",null,null,null,null,null,null,null,null,"4 Der Herrscher",{"$f":"COUNTIF($O$11:$O$40,4)","v":0},0,0,{"$f":"COUNTIF($R$11:$R$40,4)","v":0},0,0,{"$f":"COUNTIF($U$11:$U$40,4)","v":0},0]
["11 Die Gerechtigkeit",1,"2 Die Hohepriesterin",null,"Isis",null,null,null,null,null,null,null,null,"5 Der Hierophant",{"$f":"COUNTIF($O$11:$O$40,5)","v":0},0,0,{"$f":"COUNTIF($R$11:$R$40,5)","v":0},0,0,{"$f":"COUNTIF($U$11:$U$40,5)","v":0},0]
["12 Der Gehängte",0,"3 Die Herrscherin",null,"Horus",null,null,null,null,null,null,null,null,"6 Die Liebenden",{"$f":"COUNTIF($O$11:$O$40,6)","v":0},0,0,{"$f":"COUNTIF($R$11:$R$40,6)","v":0},0,0,{"$f":"COUNTIF($U$11:$U$40,6)","v":0},0]
["13 Der Tod",1,"4 Der Herrscher",null,"Osiris",null,null,null,null,null,null,null,null,"7 Der Wagen",{"$f":"COUNTIF($O$11:$O$40,7)","v":0},0,0,{"$f":"COUNTIF($R$11:$R$40,7)","v":0},0,0,{"$f":"COUNTIF($U$11:$U$40,7)","v":0},0]
["14 Die Mässigkeit",1,"5 Der Hierophant",null,"Isis",null,null,null,null,null,null,null,null,"8 Die Kraft",{"$f":"COUNTIF($O$11:$O$40,8)","v":0},0,0,{"$f":"COUNTIF($R$11:$R$40,8)","v":0},0,0,{"$f":"COUNTIF($U$11:$U$40,8)","v":1},1]
["15 Der Teufel",2,"6 Die Liebenden",null,"Horus",null,null,null,null,null,null,null,null,"9 Der Eremit",{"$f":"COUNTIF($O$11:$O$40,9)","v":1},0,0,{"$f":"COUNTIF($R$11:$R$40,9)","v":0},0,0,{"$f":"COUNTIF($U$11:$U$40,9)","v":1},2]
["16 Der Turm",0,"7 Der Wagen",null,"Osiris",null,null,null,null,null,null,null,null,"10 Das Rad des Schicksals",{"$f":"COUNTIF($O$11:$O$40,10)","v":0},0,0,{"$f":"COUNTIF($R$11:$R$40,10)","v":0},0,0,{"$f":"COUNTIF($U$11:$U$40,10)","v":0},0]
["17 Der Stern",0,"8 Die Kraft",null,"Isis",null,null,null,null,null,null,null,null,"11 Die Gerechtigkeit",{"$f":"COUNTIF($O$11:$O$40,11)","v":0},0,0,{"$f":"COUNTIF($R$11:$R$40,11)","v":0},0,0,{"$f":"COUNTIF($U$11:$U$40,11)","v":1},1]
["18 Der Mond",1,"9 Der Eremit",null,"Horus",null,null,null,null,null,null,null,null,"12 Der Gehängte",{"$f":"COUNTIF($O$11:$O$40,12)","v":0},0,0,{"$f":"COUNTIF($R$11:$R$40,12)","v":0},0,0,{"$f":"COUNTIF($U$11:$U$40,12)","v":0},0]
["19 Die Sonne",0,"1 Der Magier",null,"Osiris",null,null,null,null,null,null,null,null,"13 Der Tod",{"$f":"COUNTIF($O$11:$O$40,13)","v":1},0,0,{"$f":"COUNTIF($R$11:$R$40,13)","v":0},0,0,{"$f":"COUNTIF($U$11:$U$40,13)","v":0},1]
["20 Das Gericht",1,"2 Die Hohepriesterin",null,"Isis",null,null,null,null,null,null,null,null,"14 Die Mässigkeit",{"$f":"COUNTIF($O$11:$O$40,14)","v":0},0,0,{"$f":"COUNTIF($R$11:$R$40,14)","v":0},0,0,{"$f":"COUNTIF($U$11:$U$40,14)","v":1},1]
["21 Die Welt",0,"3 Die Herrscherin",null,"Horus",null,null,null,null,null,null,null,null,"15 Der Teufel",{"$f":"COUNTIF($O$11:$O$40,15)","v":0},0,0,{"$f":"COUNTIF($R$11:$R$40,15)","v":0},0,0,{"$f":"COUNTIF($U$11:$U$40,15)","v":2},2]
["22 Der Narr",1,"4 Der Herrscher",null,"Osiris",null,null,null,null,null,null,null,null,"16 Der Turm",{"$f":"COUNTIF($O$11:$O$40,16)","v":0},0,0,{"$f":"COUNTIF($R$11:$R$40,16)","v":0},0,0,{"$f":"COUNTIF($U$11:$U$40,16)","v":0},0]
["Summe aller Buchstaben",{"$f":"SUM(B39:B60)","v":14},null,null,null,null,null,null,null,null,null,null,null,"17 Der Stern",{"$f":"COUNTIF($O$11:$O$40,17)","v":0},0,0,{"$f":"COUNTIF($R$11:$R$40,17)","v":0},0,0,{"$f":"COUNTIF($U$11:$U$40,17)","v":0},0]
[null,null,null,null,null,null,null,null,null,null,null,null,null,"18 Der Mond",{"$f":"COUNTIF($O$11:$O$40,18)","v":1},0,0,{"$f":"COUNTIF($R$11:$R$40,18)","v":0},0,0,{"$f":"COUNTIF($U$11:$U$40,18)","v":0},1]
[null,null,null,null,null,null,null,null,null,null,null,null,null,"19 Die Sonne",{"$f":"COUNTIF($O$11:$O$40,19)","v":0},0,0,{"$f":"COUNTIF($R$11:$R$40,19)","v":0},0,0,{"$f":"COUNTIF($U$11:$U$40,19)","v":0},0]
[null,null,null,null,null,null,null,null,null,null,null,null,null,"20 Das Gericht",{"$f":"COUNTIF($O$11:$O$40,20)","v":0},0,0,{"$f":"COUNTIF($R$11:$R$40,20)","v":0},0,0,{"$f":"COUNTIF($U$11:$U$40,20)","v":1},1]
[null,null,null,null,null,null,null,null,null,null,null,null,null,"21 Die Welt",{"$f":"COUNTIF($O$11:$O$40,21)","v":0},0,0,{"$f":"COUNTIF($R$11:$R$40,21)","v":0},0,0,{"$f":"COUNTIF($U$11:$U$40,21)","v":0},0]
[null,null,null,null,null,null,null,null,null,null,null,null,null,"22 Der Narr",{"$f":"COUNTIF($O$11:$O$40,22)","v":0},0,0,{"$f":"COUNTIF($R$11:$R$40,22)","v":0},0,0,{"$f":"COUNTIF($U$11:$U$40,22)","v":1},1]
[]
[]
[]
[]
[]
[]
[]
[]
[]
[]
[]
[]
[]
[]
[]
[]
[]
[]
[]
[]
["Weitere Informationen",null,null,"Nr.","Karte","Konstellation","Gruppe"]
["Die Karte des Landes","deutschland",null,{"$f":"J88","v":3},{"$f":"IF(D88=1,\"Der Magier\",IF(D88=2,\"Die Hohepriesterin\",IF(D88=3,\"Die Herrscherin\",IF(D88=4,\"Der Herrscher\",IF(D88=5,\"Der Hierophant\",IF(D88=6,\"Die Liebenden\",IF(D88=7,\"Der Wagen\",IF(D88=8,\"Die Kraft\",IF(D88=9,\"Der Eremit\",IF(D88=10,\"Das Rad\",IF(D88=11,\"Die Gerechtigkeit\",IF(D88=12,\"Der Gehängte\",IF(D88=13,\"Der Tod\",IF(D88=14,\"Die Mässigkeit\",IF(D88=15,\"Der Teufel\",IF(D88=16,\"Der Turm\",IF(D88=17,\"Der Stern\",IF(D88=18,\"Der Mond\",IF(D88=19,\"Die Sonne\",IF(D88=20,\"Das Gericht\",IF(D88=21,\"Die Welt\",IF(D88=22,\"Der Narr\",0))))))))))))))))))))))","v":"Die Herrscherin"},{"$f":"IF(OR(D88=1,D88=10,D88=19),\"1 Der Magier\",IF(OR(D88=2,D88=11,D88=20),\"2 Die Hohepriesterin\",IF(OR(D88=3,D88=12,D88=21),\"3 Die Herrscherin\",IF(OR(D88=4,D88=13,D88=22),\"4 Der Herrscher\",IF(OR(D88=5,D88=14),\"5 Der Hierophant\",IF(OR(D88=6,D88=15),\"6 Die Liebenden\",IF(OR(D88=7,D88=16),\"7 DerWagen\",IF(OR(D88 =8,D88=17),\"8 Die Kraft\",IF(OR(D88=9,D88=18),\"9 Der Eremit\",0)))))))))","v":"3 Die Herrscherin"},{"$f":"IF(OR(D88=1,D88=4,D88=7,D88=10,D88=13,D88=16,D88=19,D88=22),\"Osiris\",IF(OR(D88=2,D88=5,D88=8,D88=11,D88=14,D88=17,D88=20),\"Isis\",IF(OR(D88=3,D88=6,D88=9,D88=12,D88=15,D88=18,D88=21),\"Horus\",0)))","v":"Horus"},{"$f":"M119","v":111},{"$f":"IF(H88>22,SUMPRODUCT(VALUE(MID(H88,ROW(INDIRECT(\"$b1:$A\"&LEN(H88))),1))),H88)","v":3},3,"Stelle","Land","Wert","Stelle","Stadt","Wert","Stelle","Stadtteil","Wert","Stelle","Strasse","Wert","Stelle","Autonummer","Wert","Stelle","Firmenname","Wert"]
["Die Karte der Stadt","zürich",null,13,{"$f":"IF(D89=1,\"Der Magier\",IF(D89=2,\"Die Hohepriesterin\",IF(D89=3,\"Die Herrscherin\",IF(D89=4,\"Der Herrscher\",IF(D89=5,\"Der Hierophant\",IF(D89=6,\"Die Liebenden\",IF(D89=7,\"Der Wagen\",IF(D89=8,\"Die Kraft\",IF(D89=9,\"Der Eremit\",IF(D89=10,\"Das Rad\",IF(D89=11,\"Die Gerechtigkeit\",IF(D89=12,\"Der Gehängte\",IF(D89=13,\"Der Tod\",IF(D89=14,\"Die Mässigkeit\",IF(D89=15,\"Der Teufel\",IF(D89=16,\"Der Turm\",IF(D89=17,\"Der Stern\",IF(D89=18,\"Der Mond\",IF(D89=19,\"Die Sonne\",IF(D89=20,\"Das Gericht\",IF(D89=21,\"Die Welt\",IF(D89=22,\"Der Narr\",0))))))))))))))))))))))","v":"Der Tod"},{"$f":"IF(OR(D89=1,D89=10,D89=19),\"1 Der Magier\",IF(OR(D89=2,D89=11,D89=20),\"2 Die Hohepriesterin\",IF(OR(D89=3,D89=12,D89=21),\"3 Die Herrscherin\",IF(OR(D89=4,D89=13,D89=22),\"4 Der Herrscher\",IF(OR(D89=5,D89=14),\"5 Der Hierophant\",IF(OR(D89=6,D89=15),\"6 Die Liebenden\",IF(OR(D89=7,D89=16),\"7 DerWagen\",IF(OR(D89 =8,D89=17),\"8 Die Kraft\",IF(OR(D89=9,D89=18),\"9 Der Eremit\",0)))))))))","v":"4 Der Herrscher"},{"$f":"IF(OR(D89=1,D89=4,D89=7,D89=10,D89=13,D89=16,D89=19,D89=22),\"Osiris\",IF(OR(D89=2,D89=5,D89=8,D89=11,D89=14,D89=17,D89=20),\"Isis\",IF(OR(D89=3,D89=6,D89=9,D89=12,D89=15,D89=18,D89=21),\"Horus\",0)))","v":"Osiris"},{"$f":"P119","v":85},13,13,1,{"$f":"IF(MID($B$88,K89,1)=\"\",\" \",MID($B$88,K89,1))","v":"d"},{"$f":"IF(ISERROR(VLOOKUP(L89,$K$11:$L$40,2,FALSE)),0,VLOOKUP(L89,$K$11:$L$40,2,FALSE))","v":4},1,{"$f":"IF(MID($B$89,N89,1)=\"\",\" \",MID($B$89,N89,1))","v":"z"},{"$f":"IF(ISERROR(VLOOKUP(O89,$K$11:$L$40,2,FALSE)),0,VLOOKUP(O89,$K$11:$L$40,2,FALSE))","v":26},1,{"$f":"IF(MID($B$90,Q89,1)=\"\",\" \",MID($B$90,Q89,1))","v":"w"},{"$f":"IF(ISERROR(VLOOKUP(R89,$K$11:$L$40,2,FALSE)),0,VLOOKUP(R89,$K$11:$L$40,2,FALSE))","v":23},1,{"$f":"IF(MID($B$91,T89,1)=\"\",\" \",MID($B$91,T89,1))","v":" "},{"$f":"IF(ISERROR(VLOOKUP(U89,$K$11:$L$40,2,FALSE)),0,VLOOKUP(U89,$K$11:$L$40,2,FALSE))","v":0},1,{"$f":"IF(MID($B$93,W89,1)=\"\",\" \",MID($B$93,W89,1))","v":"Z"},{"$f":"IF(ISERROR(VLOOKUP(X89,$K$11:$L$40,2,FALSE)),0,VLOOKUP(X89,$K$11:$L$40,2,FALSE))","v":26},1,{"$f":"IF(MID($B$94,Z89,1)=\"\",\" \",MID($B$94,Z89,1))","v":"i"},{"$f":"IF(ISERROR(VLOOKUP(AA89,$K$11:$L$40,2,FALSE)),0,VLOOKUP(AA89,$K$11:$L$40,2,FALSE))","v":9}]
["Stadtteil/Region (z.B. Zürich Oerlikon oder Weinland)","weinland",null,10,"Das Rad","1 Der Magier","Osiris",{"$f":"S119","v":82},10,10,2,{"$f":"IF(MID($B$88,K90,1)=\"\",\" \",MID($B$88,K90,1))","v":"e"},5,2,{"$f":"IF(MID($B$89,N90,1)=\"\",\" \",MID($B$89,N90,1))","v":"ü"},21,2,{"$f":"IF(MID($B$90,Q90,1)=\"\",\" \",MID($B$90,Q90,1))","v":"e"},5,2,{"$f":"IF(MID($B$91,T90,1)=\"\",\" \",MID($B$91,T90,1))","v":" "},0,2,{"$f":"IF(MID($B$93,W90,1)=\"\",\" \",MID($B$93,W90,1))","v":"H"},8,2,{"$f":"IF(MID($B$94,Z90,1)=\"\",\" \",MID($B$94,Z90,1))","v":"n"},14]
["Strasse (Bitte den Strassennamen und die Nummer separat eingeben)",null,22,22,"Der Narr","4 Der Herrscher","Osiris",{"$f":"V119+C91","v":22},22,22,3,"u",21,3,"r",18,3,"i",9,3," ",0,3," ",0,3,"f",6]
["Telefonnummer (ohne Landesvorwahl, ohne Leerzeichen)",222222222,null,18,"Der Mond","9 Der Eremit","Horus",{"$f":"B92","v":222222222},18,18,4,"t",20,4,"i",9,4,"n",14,4," ",0,4," ",0,4,"i",9]
["Autokennzeichen (Buchstaben und Nummern separat eingeben)","ZH",306608,21,"Die Welt","3 Die Herrscherin","Horus",{"$f":"Y119+C93","v":306642},21,21,5,"s",19,5,"c",3,5,"l",12,5," ",0,5," ",0,5,"s",19]
["Firmenname","infis",null,12,"Der Gehängte","3 Die Herrscherin","Horus",{"$f":"AB119","v":57},12,12,6,"c",3,6,"h",8,6,"a",1,6," ",0,6," ",0,6," ",0]
["Wichtiger Termin (bitte oben eingeben)","Bitte","oben eingeben",{"$f":"G35","v":8},"Die Kraft","8 Die Kraft","Isis",null,null,null,7,"h",8,7," ",0,7,"n",14,7," ",0,7," ",0,7," ",0]
[null,null,null,null,null,null,null,null,null,null,8,"l",12,8," ",0,8,"d",4,8," ",0,8," ",0,8," ",0]
["Die Kompatibilität ergibt sich aus der Gleichheit von Karten, Konstellationen und Gruppen",null,null,null,null,null,null,"Kontrolle",null,null,9,"a",1,9," ",0,9," ",0,9," ",0,9," ",0,9," ",0]
["Die Seelenkarte (Summe aller Vokale)",null,null,{"$f":"H19","v":6},{"$f":"IF(D98=1,\"Der Magier\",IF(D98=2,\"Die Hohepriesterin\",IF(D98=3,\"Die Herrscherin\",IF(D98=4,\"Der Herrscher\",IF(D98=5,\"Der Hierophant\",IF(D98=6,\"Die Liebenden\",IF(D98=7,\"Der Wagen\",IF(D98=8,\"Die Kraft\",IF(D98=9,\"Der Eremit\",IF(D98=10,\"Das Rad\",IF(D98=11,\"Die Gerechtigkeit\",IF(D98=12,\"Der Gehängte\",IF(D98=13,\"Der Tod\",IF(D98=14,\"Die Mässigkeit\",IF(D98=15,\"Der Teufel\",IF(D98=16,\"Der Turm\",IF(D98=17,\"Der Stern\",IF(D98=18,\"Der Mond\",IF(D98=19,\"Die Sonne\",IF(D98=20,\"Das Gericht\",IF(D98=21,\"Die Welt\",IF(D98=22,\"Der Narr\"))))))))))))))))))))))","v":"Die Liebenden"},{"$f":"IF(OR(D98=1,D98=10,D98=19),\"1 Der Magier\",IF(OR(D98=2,D98=11,D98=20),\"2 Die Hohepriesterin\",IF(OR(D98=3,D98=12,D98=21),\"3 Die Herrscherin\",IF(OR(D98=4,D98=13,D98=22),\"4 Der Herrscher\",IF(OR(D98=5,D98=14),\"5 Der Hierophant\",IF(OR(D98=6,D98=15),\"6 Die Liebenden\",IF(OR(D98=7,D98=16),\"7 DerWagen\",IF(OR(D98 =8,D98=17),\"8 Die Kraft\",IF(OR(D98=9,D98=18),\"9 Der Eremit\")))))))))","v":"6 Die Liebenden"},{"$f":"IF(OR(D98=1,D98=4,D98=7,D98=10,D98=13,D98=16,D98=19,D98=22),\"Osiris\",IF(OR(D98=2,D98=5,D98=8,D98=11,D98=14,D98=17,D98=20),\"Isis\",IF(OR(D98=3,D98=6,D98=9,D98=12,D98=15,D98=18,D98=21),\"Horus\")))","v":"Horus"},{"$f":"F19","v":51},null,null,10,"n",14,10," ",0,10," ",0,10," ",0,10," ",0,10," ",0]
["Die Karte der Persönlichkeit (Summe aller Konsonanten)",null,null,{"$f":"H20","v":7},"Der Wagen","7 DerWagen","Osiris",{"$f":"F20","v":106},null,null,11,"d",4,11," ",0,11," ",0,11," ",0,11," ",0,11," ",0]
["Die Schicksalskarte (Zahlen des gesamten Namens)",null,null,{"$f":"H15","v":13},"Der Tod","4 Der Herrscher","Osiris",{"$f":"F15","v":157},null,null,12," ",0,12," ",0,12," ",0,12," ",0,12," ",0,12," ",0]
["Die Geburtstagskarte (Tag der Geburt)",null,null,{"$f":"H16","v":12},"Der Gehängte","3 Die Herrscherin","Horus",{"$f":"D10","v":12},null,null,13," ",0,13," ",0,13," ",0,13," ",0,13," ",0,13," ",0]
["Die Persönlichkeitskarte (Geburtsdatum)",null,null,{"$f":"H17","v":19},"Die Sonne","1 Der Magier","Osiris",{"$f":"F17","v":1981},null,null,14," ",0,14," ",0,14," ",0,14," ",0,14," ",0,14," ",0]
["Das Lebenspotential (Geburtsdatum und Namen)",null,null,{"$f":"H18","v":14},"Die Mässigkeit","5 Der Hierophant","Isis",{"$f":"F18","v":2138},null,null,15," ",0,15," ",0,15," ",0,15," ",0,15," ",0,15," ",0]
[null,null,null,null,null,null,null,null,null,null,16," ",0,16," ",0,16," ",0,16," ",0,16," ",0,16," ",0]
[null,null,null,null,null,null,null,null,null,null,17," ",0,17," ",0,17," ",0,17," ",0,17," ",0,17," ",0]
["a",1,"Der Magier","1 Der Magier","Osiris",null,null,null,null,null,18," ",0,18," ",0,18," ",0,18," ",0,18," ",0,18," ",0]
["b",2,"Die Hohepriesterin","2 Die Hohepriesterin","Isis",null,null,null,null,null,19," ",0,19," ",0,19," ",0,19," ",0,19," ",0,19," ",0]
["c",3,"Die Herrscherin","3 Die Herrscherin","Horus",null,null,null,null,null,20," ",0,20," ",0,20," ",0,20," ",0,20," ",0,20," ",0]
["d",4,"Der Herrscher","4 Der Herrscher","Osiris",null,null,null,null,null,21," ",0,21," ",0,21," ",0,21," ",0,21," ",0,21," ",0]
["e",5,"Der Hierophant","5 Der Hierophant","Isis",null,null,null,null,null,22," ",0,22," ",0,22," ",0,22," ",0,22," ",0,22," ",0]
["f",6,"Die Liebenden","6 Die Liebenden","Horus",null,null,null,null,null,23," ",0,23," ",0,23," ",0,23," ",0,23," ",0,23," ",0]
["g",7,"Der Wagen","7 Der Wagen","Osiris",null,null,null,null,null,24," ",0,24," ",0,24," ",0,24," ",0,24," ",0,24," ",0]
["h",8,"Die Kraft","8 Die Kraft","Isis",null,null,null,null,null,25," ",0,25," ",0,25," ",0,25," ",0,25," ",0,25," ",0]
["i",9,"Der Eremit","9 Der Eremit","Horus",null,null,null,null,null,26," ",0,26," ",0,26," ",0,26," ",0,26," ",0,26," ",0]
["j",10,"Das Rad des Schicksals","1 Der Magier","Osiris",null,null,null,null,null,27," ",0,27," ",0,27," ",0,27," ",0,27," ",0,27," ",0]
["k",11,"Die Gerechtigkeit","2 Die Hohepriesterin","Isis",null,null,null,null,null,28," ",0,28," ",0,28," ",0,28," ",0,28," ",0,28," ",0]
["l",12,"Der Gehängte","3 Die Herrscherin","Horus",null,null,null,null,null,29," ",0,29," ",0,29," ",0,29," ",0,29," ",0,29," ",0]
["m",13,"Der Tod","4 Der Herrscher","Osiris",null,null,null,null,null,30," ",0,30," ",0,30," ",0,30," ",0,30," ",0,30," ",0]
["n",14,"Die Mässigkeit","5 Der Hierophant","Isis",null,null,null,null,null,null,null,{"$f":"SUM(M89:M118)","v":111},null,null,{"$f":"SUM(P89:P118)","v":85},null,null,{"$f":"SUM(S89:S118)","v":82},null,null,{"$f":"SUM(V89:V118)","v":0},null,null,{"$f":"SUM(Y89:Y118)","v":34},null,null,{"$f":"SUM(AB89:AB118)","v":57}]
["o",15,"Der Teufel","6 Die Liebenden","Horus"]
["p",16,"Der Turm","7 Der Wagen","Osiris"]
["q",17,"Der Stern","8 Die Kraft","Isis"]
["r",18,"Der Mond","9 Der Eremit","Horus"]
["s",19,"Die Sonne","1 Der Magier","Osiris"]
["t",20,"Das Gericht","2 Die Hohepriesterin","Isis"]
["u",21,"Die Welt","3 Die Herrscherin","Horus"]
["v",22,"Der Narr","4 Der Herrscher","Osiris"]
["w",5,"Der Hierophant","5 Der Hierophant","Isis"]
["x",6,"Die Liebenden","6 Die Liebenden","Horus"]
["y",7,"Der Wagen","7 Der Wagen","Osiris"]
["z",8,"Die Kraft","8 Die Kraft","Isis"]

{"sheet":"Numerologie 3","index":8,"n_rows":54,"n_cols":14,"rows_kept":54,"cut":false,"hidden":false,"merged":[[50,3,50,4]]}
[]
[]
[]
[null,null,null,null,null,null,null,null,null,null,null,0,"Keine Angabe",0]
["Die numerologischen Karten","Nr.","Karte","Konstellation","Gruppe","Kristalle",null,null,null,null,null,1,"Der Magier","Opal, Achat"]
["Die Seelenkarte (Summe aller Vokale)",{"$f":"'Numerologie 2'!B21","v":6},{"$f":"IF(B6=1,\"Der Magier\",IF(B6=2,\"Die Hohepriesterin\",IF(B6=3,\"Die Herrscherin\",IF(B6=4,\"Der Herrscher\",IF(B6=5,\"Der Hierophant\",IF(B6=6,\"Die Liebenden\",IF(B6=7,\"Der Wagen\",IF(B6=8,\"Die Kraft\",IF(B6=9,\"Der Eremit\",IF(B6=10,\"Das Rad\",IF(B6=11,\"Die Gerechtigkeit\",IF(B6=12,\"Der Gehängte\",IF(B6=13,\"Der Tod\",IF(B6=14,\"Die Mässigkeit\",IF(B6=15,\"Der Teufel\",IF(B6=16,\"Der Turm\",IF(B6=17,\"Der Stern\",IF(B6=18,\"Der Mond\",IF(B6=19,\"Die Sonne\",IF(B6=20,\"Das Gericht\",IF(B6=21,\"Die Welt\",IF(B6=22,\"Der Narr\"))))))))))))))))))))))","v":"Die Liebenden"},{"$f":"IF(OR(B6=1,B6=10,B6=19),\"1 Der Magier\",IF(OR(B6=2,B6=11,B6=20),\"2 Die Hohepriesterin\",IF(OR(B6=3,B6=12,B6=21),\"3 Die Herrscherin\",IF(OR(B6=4,B6=13,B6=22),\"4 Der Herrscher\",IF(OR(B6=5,B6=14),\"5 Der Hierophant\",IF(OR(B6=6,B6=15),\"6 Die Liebenden\",IF(OR(B6=7,B6=16),\"7 DerWagen\",IF(OR(B6 =8,B6=17),\"8 Die Kraft\",IF(OR(B6=9,B6=18),\"9 Der Eremit\")))))))))","v":"6 Die Liebenden"},{"$f":"IF(OR(B6=1,B6=4,B6=7,B6=10,B6=13,B6=16,B6=19,B6=22),\"Osiris\",IF(OR(B6=2,B6=5,B6=8,B6=11,B6=14,B6=17,B6=20),\"Isis\",IF(OR(B6=3,B6=6,B6=9,B6=12,B6=15,B6=18,B6=21),\"Horus\")))","v":"Horus"},{"$f":"VLOOKUP(B6,$L$4:$N$26,3,FALSE)","v":"Alexandrit, Chrysoberyll, Turmalin, durchsichtiger Calcit"},null,null,null,null,null,2,"Die Hohepriesterin","Mondstein, Perle, Bergkristall"]
["Die Karte der Persönlichkeit (Summe aller Konsonanten)",{"$f":"'Numerologie 2'!B22","v":7},"Der Wagen","7 DerWagen","Osiris",{"$f":"VLOOKUP(B7,$L$4:$N$26,3,FALSE)","v":"Bernstein"},null,null,null,null,null,3,"Die Herrscherin","Smaragd, Türkis"]
["Die Schicksalskarte (Zahlen des gesamten Namens)",{"$f":"'Numerologie 2'!B23","v":13},"Der Tod","4 Der Herrscher","Osiris","Schlangenstein (Ammonit)",null,null,null,null,null,4,"Der Herrscher","Rubin"]
["Die Geburtstagskarte (Tag der Geburt)",{"$f":"'Numerologie 2'!B24","v":12},"Der Gehängte","3 Die Herrscherin","Horus","Aquamarin, Mondstein",null,null,null,null,null,5,"Der Hierophant","Topas"]
["Die Persönlichkeitskarte (Geburtsdatum)",{"$f":"'Numerologie 2'!B25","v":19},"Die Sonne","1 Der Magier","Osiris","Heliodor, Citrin",null,null,null,null,null,6,"Die Liebenden","Alexandrit, Chrysoberyll, Turmalin, durchsichtiger Calcit"]
["Das individuelle Selbst (Rufname)",{"$f":"'Numerologie 2'!B26","v":6},"Die Liebenden","6 Die Liebenden","Horus","Alexandrit, Chrysoberyll, Turmalin, durchsichtiger Calcit",null,null,null,null,null,7,"Der Wagen","Bernstein"]
["Das verborgene Selbst (alle mittleren Namen)",{"$f":"'Numerologie 2'!B27","v":0},{"$f":"IF(B12=1,\"Der Magier\",IF(B12=2,\"Die Hohepriesterin\",IF(B12=3,\"Die Herrscherin\",IF(B12=4,\"Der Herrscher\",IF(B12=5,\"Der Hierophant\",IF(B12=6,\"Die Liebenden\",IF(B12=7,\"Der Wagen\",IF(B12=8,\"Die Kraft\",IF(B12=9,\"Der Eremit\",IF(B12=10,\"Das Rad\",IF(B12=11,\"Die Gerechtigkeit\",IF(B12=12,\"Der Gehängte\",IF(B12=13,\"Der Tod\",IF(B12=14,\"Die Mässigkeit\",IF(B12=15,\"Der Teufel\",IF(B12=16,\"Der Turm\",IF(B12=17,\"Der Stern\",IF(B12=18,\"Der Mond\",IF(B12=19,\"Die Sonne\",IF(B12=20,\"Das Gericht\",IF(B12=21,\"Die Welt\",IF(B12=22,\"Der Narr\",0))))))))))))))))))))))","v":0},{"$f":"IF(OR(B12=1,B12=10,B12=19),\"1 Der Magier\",IF(OR(B12=2,B12=11,B12=20),\"2 Die Hohepriesterin\",IF(OR(B12=3,B12=12,B12=21),\"3 Die Herrscherin\",IF(OR(B12=4,B12=13,B12=22),\"4 Der Herrscher\",IF(OR(B12=5,B12=14),\"5 Der Hierophant\",IF(OR(B12=6,B12=15),\"6 Die Liebenden\",IF(OR(B12=7,B12=16),\"7 DerWagen\",IF(OR(B12 =8,B12=17),\"8 Die Kraft\",IF(OR(B12=9,B12=18),\"9 Der Eremit\",0)))))))))","v":0},{"$f":"IF(OR(B12=1,B12=4,B12=7,B12=10,B12=13,B12=16,B12=19,B12=22),\"Osiris\",IF(OR(B12=2,B12=5,B12=8,B12=11,B12=14,B12=17,B12=20),\"Isis\",IF(OR(B12=3,B12=6,B12=9,B12=12,B12=15,B12=18,B12=21),\"Horus\",0)))","v":0},0,null,null,null,null,null,8,"Die Kraft","Tigerauge"]
["Das soziale Selbst (Nachname)",{"$f":"'Numerologie 2'!B28","v":7},{"$f":"IF(B13=1,\"Der Magier\",IF(B13=2,\"Die Hohepriesterin\",IF(B13=3,\"Die Herrscherin\",IF(B13=4,\"Der Herrscher\",IF(B13=5,\"Der Hierophant\",IF(B13=6,\"Die Liebenden\",IF(B13=7,\"Der Wagen\",IF(B13=8,\"Die Kraft\",IF(B13=9,\"Der Eremit\",IF(B13=10,\"Das Rad\",IF(B13=11,\"Die Gerechtigkeit\",IF(B13=12,\"Der Gehängte\",IF(B13=13,\"Der Tod\",IF(B13=14,\"Die Mässigkeit\",IF(B13=15,\"Der Teufel\",IF(B13=16,\"Der Turm\",IF(B13=17,\"Der Stern\",IF(B13=18,\"Der Mond\",IF(B13=19,\"Die Sonne\",IF(B13=20,\"Das Gericht\",IF(B13=21,\"Die Welt\",IF(B13=22,\"Der Narr\"))))))))))))))))))))))","v":"Der Wagen"},{"$f":"IF(OR(B13=1,B13=10,B13=19),\"1 Der Magier\",IF(OR(B13=2,B13=11,B13=20),\"2 Die Hohepriesterin\",IF(OR(B13=3,B13=12,B13=21),\"3 Die Herrscherin\",IF(OR(B13=4,B13=13,B13=22),\"4 Der Herrscher\",IF(OR(B13=5,B13=14),\"5 Der Hierophant\",IF(OR(B13=6,B13=15),\"6 Die Liebenden\",IF(OR(B13=7,B13=16),\"7 DerWagen\",IF(OR(B13 =8,B13=17),\"8 Die Kraft\",IF(OR(B13=9,B13=18),\"9 Der Eremit\")))))))))","v":"7 DerWagen"},{"$f":"IF(OR(B13=1,B13=4,B13=7,B13=10,B13=13,B13=16,B13=19,B13=22),\"Osiris\",IF(OR(B13=2,B13=5,B13=8,B13=11,B13=14,B13=17,B13=20),\"Isis\",IF(OR(B13=3,B13=6,B13=9,B13=12,B13=15,B13=18,B13=21),\"Horus\")))","v":"Osiris"},"Bernstein",null,null,null,null,null,9,"Der Eremit","Peridot, (Chrysolith)"]
["Das Lebenspotential (Geburtsdatum und Namen)",{"$f":"'Numerologie 2'!B29","v":14},"Die Mässigkeit","5 Der Hierophant","Isis","Hyazinth, Jacinth (roter bis brauner Zirkon)",null,null,null,null,null,10,"Das Rad des Schicksals","Amethyst, Lapislazuli"]
["Die Karte des ersten Buchstabens",{"$f":"'Numerologie 2'!B30","v":13},{"$f":"'Numerologie 2'!C30","v":"Der Tod"},{"$f":"'Numerologie 2'!D30","v":"4 Der Herrscher"},{"$f":"'Numerologie 2'!E30","v":"Osiris"},"Schlangenstein (Ammonit)",null,null,null,null,null,11,"Die Gerechtigkeit","Smaragd"]
["Die Karte des ersten Vokals",{"$f":"'Numerologie 2'!B31","v":1},{"$f":"'Numerologie 2'!C31","v":"Der Magier"},{"$f":"'Numerologie 2'!D31","v":"1 Der Magier"},{"$f":"'Numerologie 2'!E31","v":"Osiris"},"Opal, Achat",null,null,null,null,null,12,"Der Gehängte","Aquamarin, Mondstein"]
[null,null,null,null,null,null,null,null,null,null,null,13,"Der Tod","Schlangenstein (Ammonit)"]
[null,null,null,null,null,null,null,null,null,null,null,14,"Die Mässigkeit","Hyazinth, Jacinth (roter bis brauner Zirkon)"]
["Die Kompatibilitäten",null,null,null,null,null,null,null,null,null,null,15,"Der Teufel","Schwarzer Diamant, Onyx, Gagat"]
["1. Rang","Karte","Konstellation","Gruppe",null,null,null,null,null,null,null,16,"Der Turm","Rubin"]
["Seelenkarte + Geburtstagskarte",{"$f":"IF(B6=B9,1,0)","v":0},{"$f":"IF(D6=D9,1,0)","v":0},{"$f":"IF(E6=E9,1,0)","v":1},null,null,null,null,null,null,null,17,"Der Stern","Strass"]
["Seelenkarte + Persönlichkeitskarte",{"$f":"IF(B6=B10,1,0)","v":0},{"$f":"IF(D6=D10,1,0)","v":0},{"$f":"IF(E6=E10,1,0)","v":0},null,null,null,null,null,null,null,18,"Der Mond","Perle"]
["Karte der Persönlichkeit + Geburtstagskarte",{"$f":"IF(B7=B9,1,0)","v":0},{"$f":"IF(D7=D9,1,0)","v":0},{"$f":"IF(E7=E9,1,0)","v":0},null,null,null,null,null,null,null,19,"Die Sonne","Heliodor, Citrin"]
["Karte der Persönlichkeit + Persönlichkeitskarte",{"$f":"IF(B7=B10,1,0)","v":0},{"$f":"IF(D7=D10,1,0)","v":0},{"$f":"IF(E7=E10,1,0)","v":1},null,null,null,null,null,null,null,20,"Das Gericht","Feueropal, Rubin, Diamant, Herkimer Diamant, klarer Topas"]
["Schicksalskarte + Geburtstagskarte",{"$f":"IF(B8=B9,1,0)","v":0},{"$f":"IF(D8=D9,1,0)","v":0},{"$f":"IF(E8=E9,1,0)","v":0},null,null,null,null,null,null,null,21,"Die Welt","Onyx, Salz, Halit, Moosachat"]
["Schicksalskarte + Persönlichkeitskarte",{"$f":"IF(B8=B10,1,0)","v":0},{"$f":"IF(D8=D10,1,0)","v":0},{"$f":"IF(E8=E10,1,0)","v":1},null,null,null,null,null,null,null,22,"Der Narr","Topas, Chalcedon, Opal"]
["Lebenspotential + Geburtstagskarte",{"$f":"IF(B14=B9,1,0)","v":0},{"$f":"IF(D14=D9,1,0)","v":0},{"$f":"IF(E14=E9,1,0)","v":0}]
["Lebenspotential + Persönlichkeitskarte",{"$f":"IF(B14=B10,1,0)","v":0},{"$f":"IF(D14=D10,1,0)","v":0},{"$f":"IF(E14=E10,1,0)","v":0}]
["Summe",{"$f":"SUM(B21:B28)","v":0},{"$f":"SUM(C21:C28)","v":0},{"$f":"SUM(D21:D28)","v":3},{"$f":"SUM(B29:D29)","v":3}]
[]
[]
["2. Rang","Karte","Konstellation","Gruppe"]
["Seelenkarte + Karte der Persönlichkeit",{"$f":"IF(B6=B7,1,0)","v":0},{"$f":"IF(D6=D7,1,0)","v":0},{"$f":"IF(E6=E7,1,0)","v":0}]
["Seelenkarte + Schicksalskarte",{"$f":"IF(B6=B8,1,0)","v":0},{"$f":"IF(D6=D8,1,0)","v":0},{"$f":"IF(E6=E8,1,0)","v":0}]
["Karte der Persönlichkeit + Schicksalskarte",{"$f":"IF(B7=B8,1,0)","v":0},{"$f":"IF(D7=D8,1,0)","v":0},{"$f":"IF(E7=E8,1,0)","v":1}]
["Seelenkarte + Lebenspotential",{"$f":"IF(B6=B14,1,0)","v":0},{"$f":"IF(D6=D14,1,0)","v":0},{"$f":"IF(E6=E14,1,0)","v":0}]
["Karte der Persönlichkeit + Lebenspotential",{"$f":"IF(B7=B14,1,0)","v":0},{"$f":"IF(D7=D14,1,0)","v":0},{"$f":"IF(E7=E14,1,0)","v":0}]
["Schicksalskarte + Lebenspotential",{"$f":"IF(B8=B14,1,0)","v":0},{"$f":"IF(D8=D14,1,0)","v":0},{"$f":"IF(E8=E14,1,0)","v":0}]
["Geburtstagskarte + Persönlichkeitskarte",{"$f":"IF(B9=B10,1,0)","v":0},{"$f":"IF(D9=D10,1,0)","v":0},{"$f":"IF(E9=E10,1,0)","v":0}]
["Summe",{"$f":"SUM(B33:B39)","v":0},{"$f":"SUM(C33:C39)","v":0},{"$f":"SUM(D33:D39)","v":1},{"$f":"SUM(B40:D40)","v":1}]
["Summe 1. Rang + 2. Rang",null,null,null,{"$f":"E29+E40","v":4}]
[]
["Die gemeinsame Beziehungskarte","Jahr","Monat","Tag"]
["Geburtstag Person 1",1976,4,20,{"$f":"SUM(B44:D44)","v":2000},{"$f":"SUMPRODUCT(MID(E44,ROW(INDIRECT(\"1:\"&LEN(E44))),1)*1)","v":2},{"$f":"IF(F44>22,SUMPRODUCT(VALUE(MID(F44,ROW(INDIRECT(\"$b1:$A\"&LEN(F44))),1))),F44)","v":2}]
["Geburtstag Person 2",1984,4,18,{"$f":"SUM(B45:D45)","v":2006},{"$f":"SUMPRODUCT(MID(E45,ROW(INDIRECT(\"1:\"&LEN(E45))),1)*1)","v":8},{"$f":"IF(F45>22,SUMPRODUCT(VALUE(MID(F45,ROW(INDIRECT(\"$b1:$A\"&LEN(F45))),1))),F45)","v":8}]
[null,null,null,null,{"$f":"SUM(E44:E45)","v":4006},{"$f":"SUMPRODUCT(MID(E46,ROW(INDIRECT(\"1:\"&LEN(E46))),1)*1)","v":10},{"$f":"IF(F46>22,SUMPRODUCT(VALUE(MID(F46,ROW(INDIRECT(\"$b1:$A\"&LEN(F46))),1))),F46)","v":10}]
[]
[]
[]
[]
[null,"Nr. ","Karte","Wesenskarte",null,"Zweite Wesenskarte"]
["Persönlichkeitskarte Person 1",{"$f":"G44","v":2},{"$f":"IF(B52=1,\"Der Magier\",IF(B52=2,\"Die Hohepriesterin\",IF(B52=3,\"Die Herrscherin\",IF(B52=4,\"Der Herrscher\",IF(B52=5,\"Der Hierophant\",IF(B52=6,\"Die Liebenden\",IF(B52=7,\"Der Wagen\",IF(B52=8,\"Die Kraft\",IF(B52=9,\"Der Eremit\",IF(B52=10,\"Das Rad\",IF(B52=11,\"Die Gerechtigkeit\",IF(B52=12,\"Der Gehängte\",IF(B52=13,\"Der Tod\",IF(B52=14,\"Die Mässigkeit\",IF(B52=15,\"Der Teufel\",IF(B52=16,\"Der Turm\",IF(B52=17,\"Der Stern\",IF(B52=18,\"Der Mond\",IF(B52=19,\"Die Sonne\",IF(B52=20,\"Das Gericht\",IF(B52=21,\"Die Welt\",IF(B52=22,\"Der Narr\"))))))))))))))))))))))","v":"Die Hohepriesterin"},{"$f":"IF(B52>9,SUMPRODUCT(VALUE(MID(B52,ROW(INDIRECT(\"$b1:$A\"&LEN(B52))),1))),B52+9)","v":11},"Die Gerechtigkeit",{"$f":"IF(B52=1,19,IF(B52=2,20,IF(B52=3,21,IF(B52=4,22,IF(B52=10,19,IF(B52=11,20,IF(B52=12,21,IF(B52=13,22,IF(B52=19,1,IF(B52=20,11,IF(B52=21,12,IF(B52=22,13,\"Keine\"))))))))))))","v":20}]
["Persönlichkeitskarte Person 2",{"$f":"G45","v":8},"Die Kraft",{"$f":"IF(B53>9,SUMPRODUCT(VALUE(MID(B53,ROW(INDIRECT(\"$b1:$A\"&LEN(B53))),1))),B53+9)","v":17},"Der Stern",{"$f":"IF(B53=1,19,IF(B53=2,20,IF(B53=3,21,IF(B53=4,22,IF(B53=10,19,IF(B53=11,20,IF(B53=12,21,IF(B53=13,22,IF(B53=19,1,IF(B53=20,11,IF(B53=21,12,IF(B53=22,13,\"Keine\"))))))))))))","v":"Keine"}]
["Gemeinsame Beziehungskarte",{"$f":"G46","v":10},"Das Rad",1,"Der Magier",19]

{"sheet":"Astrologie 1","index":9,"n_rows":146,"n_cols":21,"rows_kept":146,"cut":false,"hidden":false,"merged":[[19,12,19,13]]}
[]
[]
["Astrologische Karten für",{"$f":"Jahreskarten!E8","v":"Zum "},{"$f":"Jahreskarten!F8","v":"Beispiel"}]
["Lassen Sie zuerst das Horoskop berechnen und geben Sie dann die entsprechenden Informationen im Formularfeld ein. Die Felder für Ihre Eingaben sind rot markiert."]
["Die Karten, die Sie in den zwölf Häusern finden, sind violett markiert. Verwenden Sie diese für die Interpretation."]
[]
["Die Planeten","Haus","Tierkreiszeichen","Dekanat","Die Häuser","Tierkreiszeichen","Häuser","Tierkreiszeichen","Dekanat Aszendent"]
["3 Saturn","7. Haus","10 Steinbock","2. Dekanat","1. Haus AC","4 Krebs","7. Haus DC","10 Steinbock","2. Dekanat"]
["4 Jupiter","12. Haus","3 Zwillinge","2. Dekanat","2. Haus","4 Krebs","8.  Haus","10 Steinbock"]
["5 Mars","12. Haus","4 Krebs","1. Dekanat","3. Haus","5 Löwe","9.  Haus","11 Wassermann"]
["6 Sonne","11. Haus","2 Stier","3. Dekanat","4. Haus IC","6 Jungfrau","10. Haus MC","12 Fische"]
["7 Venus","12. Haus","3 Zwillinge","1. Dekanat","5. Haus","7 Waage","11. Haus","1 Widder"]
["8 Merkur","12. Haus","3 Zwillinge","1. Dekanat","6. Haus","9 Schütze","12. Haus","3 Zwillinge"]
["9 Mond","4. Haus","6 Jungfrau","3. Dekanat"]
["Uranus","6. Haus","10 Steinbock","1. Dekanat"]
["Neptun","7. Haus","10 Steinbock","2. Dekanat"]
["Pluto","5. Haus","8 Skorpion","2. Dekanat"]
[]
[null,null,null,null,null,null,null,null,null,null,null,null,null,null,null,null,0,0,0,0,0]
["Die zwölf Häuser","Spitze","Karte der Spitze","Herrscher","Karte des Herrschers","Ev. Planet","Karte des Planeten","Zeichen des Planeten","Karte des Zeichens","Stärke des Planeten",null,null,"Kleine Arkana",null,null,null,"1 Widder","Herrscher","3 Saturn","1. Dekanat","1. Haus"]
["1. Haus: ^ Persönlichkeit, Individualität (Aszendent)",{"$f":"F8","v":"4 Krebs"},{"$f":"IF(B21=\"1 Widder\",\"4 Der Herrscher\",IF(B21=\"2 Stier\",\"5 Der Hierophant\",IF(B21=\"3 Zwillinge\",\"6 Die Liebenden\",IF(B21=\"4 Krebs\",\"7 Der Wagen\",IF(B21=\"5 Löwe\",\"8 Die Kraft\",IF(B21=\"6 Jungfrau\",\"9 Der Eremit\",IF(B21=\"7 Waage\",\"11 Die Gerechtigkeit\",IF(B21=\"8 Skorpion\",\"13 Der Tod\",IF(B21=\"9 Schütze\",\"14 Die Mässigkeit\",IF(B21=\"10 Steinbock\",\"15 Der Teufel\",IF(B21=\"11 Wassermann\",\"17 Der Stern\",IF(B21=\"12 Fische\",\"18 Der Mond\"))))))))))))","v":"7 Der Wagen"},{"$f":"IF(B21=\"1 Widder\",\"5 Mars\",IF(B21=\"2 Stier\",\"7 Venus\",IF(B21=\"3 Zwillinge\",\"8 Merkur\",IF(B21=\"4 Krebs\",\"9 Mond\",IF(B21=\"5 Löwe\",\"6 Sonne\",IF(B21=\"6 Jungfrau\",\"8 Merkur\",IF(B21=\"7 Waage\",\"7 Venus\",IF(B21=\"8 Skorpion\",\"5 Mars\",IF(B21=\"9 Schütze\",\"4 Jupiter\",IF(B21=\"10 Steinbock\",\"3 Saturn\",IF(B21=\"11 Wassermann\",\"3 Saturn\",IF(B21=\"12 Fische\",\"4 Jupiter\"))))))))))))","v":"9 Mond"},{"$f":"IF(D21=\"3 Saturn\",\"21 Die Welt\",IF(D21=\"4 Jupiter\",\"10 Das Rad\",IF(D21=\"5 Mars\",\"16 Der Turm\",IF(D21=\"6 Sonne\",\"19 Die Sonne\",IF(D21=\"7 Venus\",\"3 Die Herrscherin\",IF(D21=\"8 Merkur\",\"1 Der Magier\",IF(D21=\"9 Mond\",\"2 Die Hohepriesterin\",IF(D21=0,0))))))))","v":"2 Die Hohepriesterin"},{"$f":"IF($B$8=\"1. Haus\",\"3 Saturn\",0)","v":0},{"$f":"IF(F21=\"3 Saturn\",\"21 Die Welt\",IF(F21=\"4 Jupiter\",\"10 Das Rad\",IF(F21=\"5 Mars\",\"16 Der Turm\",IF(F21=\"6 Sonne\",\"19 Die Sonne\",IF(F21=\"7 Venus\",\"3 Die Herrscherin\",IF(F21=\"8 Merkur\",\"1 Der Magier\",IF(F21=\"9 Mond\",\"2 Die Hohepriesterin\",IF(F21=\"Uranus\",\"0 Der Narr\",IF(F21=\"Neptun\",\"12 Der Gehängte\",IF(F21=\"Pluto\",\"20 Das Gericht\",IF(F21=0,0)))))))))))","v":0},{"$f":"IF(F21<>0,$C$8,0)","v":0},{"$f":"IF(H21=\"1 Widder\",\"4 Der Herrscher\",IF(H21=\"2 Stier\",\"5 Der Hierophant\",IF(H21=\"3 Zwillinge\",\"6 Die Liebenden\",IF(H21=\"4 Krebs\",\"7 Der Wagen\",IF(H21=\"5 Löwe\",\"8 Die Kraft\",IF(H21=\"6 Jungfrau\",\"9 Der Eremit\",IF(H21=\"7 Waage\",\"11 Die Gerechtigkeit\",IF(H21=\"8 Skorpion\",\"13 Der Tod\",IF(H21=\"9 Schütze\",\"14 Die Mässigkeit\",IF(H21=\"10 Steinbock\",\"15 Der Teufel\",IF(H21=\"11 Wassermann\",\"17 Der Stern\",IF(H21=\"12 Fische\",\"18 Der Mond\",IF(H21=0,0)))))))))))))","v":0},{"$f":"IF(OR(H21=\"10 Steinbock\",H21=\"11 Wassermann\"),\"Herrscher\",IF(H21=\"7 Waage\",\"Erhöhung\",IF(H21=\"1 Widder\",\"Fall\",IF(OR(H21=\"4 Krebs\",H21=\"5 Löwe\"),\"Exil\",0))))","v":0},{"$f":"IF(G21<>0,D8,0)","v":0},{"$f":"IF(OR(H21=\"1 Widder\",H21=\"4 Krebs\",H21=\"7 Waage\",H21=\"10 Steinbock\"),\"Kardinal\",IF(OR(H21=\"2 Stier\",H21=\"5 Löwe\",H21=\"8 Skorpion\",H21=\"11 Wassermann\"),\"Fix\",IF(OR(H21=\"3 Zwillinge\",H21=\"6 Jungfrau\",H21=\"9 Schütze\",H21=\"12 Fische\"),\"Veränderlich\",0)))","v":0},{"$f":"IF(AND(L21=\"Kardinal\",K21=\"1. Dekanat\"),2,IF(AND(L21=\"Kardinal\",K21=\"2. Dekanat\"),3,IF(AND(L21=\"Kardinal\",K21=\"3. Dekanat\"),4,IF(AND(L21=\"Fix\",K21=\"1. Dekanat\"),5,IF(AND(L21=\"Fix\",K21=\"2. Dekanat\"),6,IF(AND(L21=\"Fix\",K21=\"3. Dekanat\"),7,IF(AND(L21=\"Veränderlich\",K21=\"1. Dekanat\"),8,IF(AND(L21=\"Veränderlich\",K21=\"2. Dekanat\"),9,IF(AND(L21=\"Veränderlich\",K21=\"3. Dekanat\"),10,0)))))))))","v":0},{"$f":"IF(OR(H21=\"1 Widder\",H21=\"5 Löwe\",H21=\"9 Schütze\"),\"Stäbe\",IF(OR(H21=\"2 Stier\",H21=\"6 Jungfrau\",H21=\"10 Steinbock\"),\"Münzen\",IF(OR(H21=\"3 Zwillinge\",H21=\"7 Waage\",H21=\"11 Wassermann\"),\"Schwerter\",IF(OR(H21=\"4 Krebs\",H21=\"8 Skorpion\",H21=\"12 Fische\"),\"Kelche\",0))))","v":0},null,null,"2 Stier","Erhöhung","4 Jupiter","2. Dekanat","2. Haus"]
["Ich bin. ",null,null,{"$f":"IF(B21=\"8 Skorpion\",\"Pluto\",IF(B21=\"11 Wassermann\",\"Uranus\",IF(B21=\"12 Fische\",\"Neptun\",0)))","v":0},{"$f":"IF(D22=\"Pluto\",\"20 Das Gericht\",IF(D22=\"Uranus\",\"0 Der Narr\",IF(D22=\"Neptun\",\"12 Der Gehängte\",0)))","v":0},{"$f":"IF($B$9=\"1. Haus\",\"4 Jupiter\",0)","v":0},{"$f":"IF(F22=\"3 Saturn\",\"21 Die Welt\",IF(F22=\"4 Jupiter\",\"10 Das Rad\",IF(F22=\"5 Mars\",\"16 Der Turm\",IF(F22=\"6 Sonne\",\"19 Die Sonne\",IF(F22=\"7 Venus\",\"3 Die Herrscherin\",IF(F22=\"8 Merkur\",\"1 Der Magier\",IF(F22=\"9 Mond\",\"2 Die Hohepriesterin\",IF(F22=\"Uranus\",\"0 Der Narr\",IF(F22=\"Neptun\",\"12 Der Gehängte\",IF(F22=\"Pluto\",\"20 Das Gericht\",IF(F22=0,0)))))))))))","v":0},{"$f":"IF(F22<>0,$C$9,0)","v":0},{"$f":"IF(H22=\"1 Widder\",\"4 Der Herrscher\",IF(H22=\"2 Stier\",\"5 Der Hierophant\",IF(H22=\"3 Zwillinge\",\"6 Die Liebenden\",IF(H22=\"4 Krebs\",\"7 Der Wagen\",IF(H22=\"5 Löwe\",\"8 Die Kraft\",IF(H22=\"6 Jungfrau\",\"9 Der Eremit\",IF(H22=\"7 Waage\",\"11 Die Gerechtigkeit\",IF(H22=\"8 Skorpion\",\"13 Der Tod\",IF(H22=\"9 Schütze\",\"14 Die Mässigkeit\",IF(H22=\"10 Steinbock\",\"15 Der Teufel\",IF(H22=\"11 Wassermann\",\"17 Der Stern\",IF(H22=\"12 Fische\",\"18 Der Mond\",IF(H22=0,0)))))))))))))","v":0},{"$f":"IF(OR(H22=\"9 Schütze\",H22=\"12 Fische\"),\"Herrscher\",IF(H22=\"4 Krebs\",\"Erhöhung\",IF(H22=\"10 Steinbock\",\"Fall\",IF(OR(H22=\"3 Zwillinge\",H22=\"6 Jungfrau\"),\"Exil\",0))))","v":0},{"$f":"IF(G22<>0,D9,0)","v":0},{"$f":"IF(OR(H22=\"1 Widder\",H22=\"4 Krebs\",H22=\"7 Waage\",H22=\"10 Steinbock\"),\"Kardinal\",IF(OR(H22=\"2 Stier\",H22=\"5 Löwe\",H22=\"8 Skorpion\",H22=\"11 Wassermann\"),\"Fix\",IF(OR(H22=\"3 Zwillinge\",H22=\"6 Jungfrau\",H22=\"9 Schütze\",H22=\"12 Fische\"),\"Veränderlich\",0)))","v":0},{"$f":"IF(AND(L22=\"Kardinal\",K22=\"1. Dekanat\"),2,IF(AND(L22=\"Kardinal\",K22=\"2. Dekanat\"),3,IF(AND(L22=\"Kardinal\",K22=\"3. Dekanat\"),4,IF(AND(L22=\"Fix\",K22=\"1. Dekanat\"),5,IF(AND(L22=\"Fix\",K22=\"2. Dekanat\"),6,IF(AND(L22=\"Fix\",K22=\"3. Dekanat\"),7,IF(AND(L22=\"Veränderlich\",K22=\"1. Dekanat\"),8,IF(AND(L22=\"Veränderlich\",K22=\"2. Dekanat\"),9,IF(AND(L22=\"Veränderlich\",K22=\"3. Dekanat\"),10,0)))))))))","v":0},{"$f":"IF(OR(H22=\"1 Widder\",H22=\"5 Löwe\",H22=\"9 Schütze\"),\"Stäbe\",IF(OR(H22=\"2 Stier\",H22=\"6 Jungfrau\",H22=\"10 Steinbock\"),\"Münzen\",IF(OR(H22=\"3 Zwillinge\",H22=\"7 Waage\",H22=\"11 Wassermann\"),\"Schwerter\",IF(OR(H22=\"4 Krebs\",H22=\"8 Skorpion\",H22=\"12 Fische\"),\"Kelche\",0))))","v":0},null,null,"3 Zwillinge","Fall","5 Mars","3. Dekanat","3. Haus"]
["Physischer Körper, physische Erscheinung und Gesundheit.",null,null,null,null,{"$f":"IF($B$10=\"1. Haus\",\"5 Mars\",0)","v":0},0,{"$f":"IF(F23<>0,$C$10,0)","v":0},{"$f":"IF(H23=\"1 Widder\",\"4 Der Herrscher\",IF(H23=\"2 Stier\",\"5 Der Hierophant\",IF(H23=\"3 Zwillinge\",\"6 Die Liebenden\",IF(H23=\"4 Krebs\",\"7 Der Wagen\",IF(H23=\"5 Löwe\",\"8 Die Kraft\",IF(H23=\"6 Jungfrau\",\"9 Der Eremit\",IF(H23=\"7 Waage\",\"11 Die Gerechtigkeit\",IF(H23=\"8 Skorpion\",\"13 Der Tod\",IF(H23=\"9 Schütze\",\"14 Die Mässigkeit\",IF(H23=\"10 Steinbock\",\"15 Der Teufel\",IF(H23=\"11 Wassermann\",\"17 Der Stern\",IF(H23=\"12 Fische\",\"18 Der Mond\",IF(H23=0,0)))))))))))))","v":0},{"$f":"IF(OR(H23=\"1 Widder\",H23=\"8 Skorpion\"),\"Herrscher\",IF(H23=\"10 Steinbock\",\"Erhöhung\",IF(H23=\"4 Krebs\",\"Fall\",IF(OR(H23=\"2 Stier\",H23=\"7 Waage\"),\"Exil\",0))))","v":0},0,0,0,0,null,null,"4 Krebs","Exil","6 Sonne",null,"4. Haus"]
["Persönlichkeit, das Ich, Selbstausdruck, Ichgefühl, ",null,null,null,null,{"$f":"IF($B$11=\"1. Haus\",\"6 Sonne\",0)","v":0},0,{"$f":"IF(F24<>0,$C$11,0)","v":0},0,{"$f":"IF(H24=\"5 Löwe\",\"Herrscher\",0)","v":0},0,0,0,0,null,null,"5 Löwe","Herrscher + Erhöhung","7 Venus",null,"5. Haus"]
["Grundstimmung, das Auftreten. Interessen. Selbstbehauptung, ",null,null,null,null,{"$f":"IF($B$12=\"1. Haus\",\"7 Venus\",0)","v":0},0,{"$f":"IF(F25<>0,$C$12,0)","v":0},0,{"$f":"IF(OR(H25=\"2 Stier\",H25=\"7 Waage\"),\"Herrscher\",IF(H25=\"12 Fische\",\"Erhöhung\",IF(H25=\"6 Jungfrau\",\"Fall\",IF(OR(H25=\"8 Skorpion\",H25=\"1 Widder\"),\"Exil\",0))))","v":0},0,0,0,0,null,null,"6 Jungfrau","Fall + Exil","8 Merkur",null,"6. Haus"]
["Durchsetzungskraft, Anfänge. Die Persona oder Maske, ",null,null,null,null,{"$f":"IF($B$13=\"1. Haus\",\"8 Merkur\",0)","v":0},0,{"$f":"IF(F26<>0,$C$13,0)","v":0},0,{"$f":"IF(H26=\"3 Zwillinge\",\"Herrscher\",IF(H26=\"6 Jungfrau\",\"Herrscher u. Erhöhung\",IF(H26=\"12 Fische\",\"Fall u. Exil\",IF(H26=\"9 Schütze\",\"Exil\",0))))","v":0},0,0,0,0,null,null,"7 Waage",null,"9 Mond",null,"7. Haus"]
["die nach aussen gezeigt wird. Kindliche Umgebung. ",null,null,null,null,{"$f":"IF($B$14=\"1. Haus\",\"9 Mond\",0)","v":0},0,{"$f":"IF(F27<>0,$C$14,0)","v":0},{"$f":"IF(H27=\"1 Widder\",\"4 Der Herrscher\",IF(H27=\"2 Stier\",\"5 Der Hierophant\",IF(H27=\"3 Zwillinge\",\"6 Die Liebenden\",IF(H27=\"4 Krebs\",\"7 Der Wagen\",IF(H27=\"5 Löwe\",\"8 Die Kraft\",IF(H27=\"6 Jungfrau\",\"9 Der Eremit\",IF(H27=\"7 Waage\",\"11 Die Gerechtigkeit\",IF(H27=\"8 Skorpion\",\"13 Der Tod\",IF(H27=\"9 Schütze\",\"14 Die Mässigkeit\",IF(H27=\"10 Steinbock\",\"15 Der Teufel\",IF(H27=\"11 Wassermann\",\"17 Der Stern\",IF(H27=\"12 Fische\",\"18 Der Mond\",IF(H27=0,0)))))))))))))","v":0},{"$f":"IF(H27=\"4 Krebs\",\"Herrscher\",IF(H27=\"2 Stier\",\"Erhöhung\",IF(H27=\"8 Skorpion\",\"Fall\",IF(H27=\"10 Steinbock\",\"Exil\",0))))","v":0},0,0,0,0,null,null,"8 Skorpion",null,null,null,"8. Haus"]
[null,null,null,null,null,{"$f":"IF($B$15=\"1. Haus\",\"Uranus\",0)","v":0},0,{"$f":"IF(F28<>0,$C$15,0)","v":0},{"$f":"IF(H28=\"1 Widder\",\"4 Der Herrscher\",IF(H28=\"2 Stier\",\"5 Der Hierophant\",IF(H28=\"3 Zwillinge\",\"6 Die Liebenden\",IF(H28=\"4 Krebs\",\"7 Der Wagen\",IF(H28=\"5 Löwe\",\"8 Die Kraft\",IF(H28=\"6 Jungfrau\",\"9 Der Eremit\",IF(H28=\"7 Waage\",\"11 Die Gerechtigkeit\",IF(H28=\"8 Skorpion\",\"13 Der Tod\",IF(H28=\"9 Schütze\",\"14 Die Mässigkeit\",IF(H28=\"10 Steinbock\",\"15 Der Teufel\",IF(H28=\"11 Wassermann\",\"17 Der Stern\",IF(H28=\"12 Fische\",\"18 Der Mond\",IF(H28=0,0)))))))))))))","v":0},{"$f":"IF(H28=\"11 Wassermann\",\"Herrscher\",IF(H28=\"5 Löwe\",\"Exil\",0))","v":0},0,0,0,0,null,null,"9 Schütze",null,null,null,"9. Haus"]
[null,null,null,null,null,{"$f":"IF($B$16=\"1. Haus\",\"Neptun\",0)","v":0},0,{"$f":"IF(F29<>0,$C$16,0)","v":0},0,{"$f":"IF(H29=\"12 Fische\",\"Herrscher\",IF(H29=\"6 Jungfrau\",\"Exil\",0))","v":0},0,0,0,0,null,null,"10 Steinbock",null,null,null,"10. Haus"]
[null,null,null,null,null,{"$f":"IF($B$17=\"1. Haus\",\"Pluto\",0)","v":0},0,{"$f":"IF(F30<>0,$C$17,0)","v":0},0,{"$f":"IF(H30=\"8 Skorpion\",\"Herrscher\",IF(H30=\"2 Stier\",\"Exil\",0))","v":0},0,0,0,0,null,null,"11 Wassermann",null,null,null,"11. Haus"]
["2. Haus: _ Erwerb und Besitz",{"$f":"F9","v":"4 Krebs"},{"$f":"IF(B31=\"1 Widder\",\"4 Der Herrscher\",IF(B31=\"2 Stier\",\"5 Der Hierophant\",IF(B31=\"3 Zwillinge\",\"6 Die Liebenden\",IF(B31=\"4 Krebs\",\"7 Der Wagen\",IF(B31=\"5 Löwe\",\"8 Die Kraft\",IF(B31=\"6 Jungfrau\",\"9 Der Eremit\",IF(B31=\"7 Waage\",\"11 Die Gerechtigkeit\",IF(B31=\"8 Skorpion\",\"13 Der Tod\",IF(B31=\"9 Schütze\",\"14 Die Mässigkeit\",IF(B31=\"10 Steinbock\",\"15 Der Teufel\",IF(B31=\"11 Wassermann\",\"17 Der Stern\",IF(B31=\"12 Fische\",\"18 Der Mond\"))))))))))))","v":"7 Der Wagen"},{"$f":"IF(B31=\"1 Widder\",\"5 Mars\",IF(B31=\"2 Stier\",\"7 Venus\",IF(B31=\"3 Zwillinge\",\"8 Merkur\",IF(B31=\"4 Krebs\",\"9 Mond\",IF(B31=\"5 Löwe\",\"6 Sonne\",IF(B31=\"6 Jungfrau\",\"8 Merkur\",IF(B31=\"7 Waage\",\"7 Venus\",IF(B31=\"8 Skorpion\",\"5 Mars\",IF(B31=\"9 Schütze\",\"4 Jupiter\",IF(B31=\"10 Steinbock\",\"3 Saturn\",IF(B31=\"11 Wassermann\",\"3 Saturn\",IF(B31=\"12 Fische\",\"4 Jupiter\"))))))))))))","v":"9 Mond"},{"$f":"IF(D31=\"3 Saturn\",\"21 Die Welt\",IF(D31=\"4 Jupiter\",\"10 Das Rad\",IF(D31=\"5 Mars\",\"16 Der Turm\",IF(D31=\"6 Sonne\",\"19 Die Sonne\",IF(D31=\"7 Venus\",\"3 Die Herrscherin\",IF(D31=\"8 Merkur\",\"1 Der Magier\",IF(D31=\"9 Mond\",\"2 Die Hohepriesterin\",IF(D31=0,0))))))))","v":"2 Die Hohepriesterin"},{"$f":"IF($B$8=\"2. Haus\",\"3 Saturn\",0)","v":0},0,{"$f":"IF(F31<>0,$C$8,0)","v":0},0,{"$f":"IF(OR(H31=\"10 Steinbock\",H31=\"11 Wassermann\"),\"Herrscher\",IF(H31=\"7 Waage\",\"Erhöhung\",IF(H31=\"1 Widder\",\"Fall\",IF(OR(H31=\"4 Krebs\",H31=\"5 Löwe\"),\"Exil\",0))))","v":0},{"$f":"IF(G31<>0,D8,0)","v":0},0,0,{"$f":"IF(OR(H31=\"1 Widder\",H31=\"5 Löwe\",H31=\"9 Schütze\"),\"Stäbe\",IF(OR(H31=\"2 Stier\",H31=\"6 Jungfrau\",H31=\"10 Steinbock\"),\"Münzen\",IF(OR(H31=\"3 Zwillinge\",H31=\"7 Waage\",H31=\"11 Wassermann\"),\"Schwerter\",IF(OR(H31=\"4 Krebs\",H31=\"8 Skorpion\",H31=\"12 Fische\"),\"Kelche\",0))))","v":0},null,null,"12 Fische",null,null,null,"12. Haus"]
["Ich besitze. ",null,null,{"$f":"IF(B31=\"8 Skorpion\",\"Pluto\",IF(B31=\"11 Wassermann\",\"Uranus\",IF(B31=\"12 Fische\",\"Neptun\",0)))","v":0},{"$f":"IF(D32=\"Pluto\",\"20 Das Gericht\",IF(D32=\"Uranus\",\"0 Der Narr\",IF(D32=\"Neptun\",\"12 Der Gehängte\",0)))","v":0},{"$f":"IF($B$9=\"2. Haus\",\"4 Jupiter\",0)","v":0},0,{"$f":"IF(F32<>0,$C$9,0)","v":0},0,{"$f":"IF(OR(H32=\"9 Schütze\",H32=\"12 Fische\"),\"Herrscher\",IF(H32=\"4 Krebs\",\"Erhöhung\",IF(H32=\"10 Steinbock\",\"Fall\",IF(OR(H32=\"3 Zwillinge\",H32=\"6 Jungfrau\"),\"Exil\",0))))","v":0},{"$f":"IF(G32<>0,D9,0)","v":0},0,0,0]
["Besitz, finanzielle Situation, Gewinn oder Verlust, Vermögen, ",null,null,null,null,{"$f":"IF($B$10=\"2. Haus\",\"5 Mars\",0)","v":0},0,{"$f":"IF(F33<>0,$C$10,0)","v":0},0,{"$f":"IF(OR(H33=\"1 Widder\",H33=\"8 Skorpion\"),\"Herrscher\",IF(H33=\"10 Steinbock\",\"Erhöhung\",IF(H33=\"4 Krebs\",\"Fall\",IF(OR(H33=\"2 Stier\",H33=\"7 Waage\"),\"Exil\",0))))","v":0},0,0,0,0]
["Schulden. Werte, was wertgeschätzt wird. Kreative ",null,null,null,null,{"$f":"IF($B$11=\"2. Haus\",\"6 Sonne\",0)","v":0},0,{"$f":"IF(F34<>0,$C$11,0)","v":0},0,{"$f":"IF(H34=\"5 Löwe\",\"Herrscher\",0)","v":0},0,0,0,0]
["Fähigkeiten, Talente. Sicherheit. Einnahmen und Ausgaben. ",null,null,null,null,{"$f":"IF($B$12=\"2. Haus\",\"7 Venus\",0)","v":0},0,{"$f":"IF(F35<>0,$C$12,0)","v":0},0,{"$f":"IF(OR(H35=\"2 Stier\",H35=\"7 Waage\"),\"Herrscher\",IF(H35=\"12 Fische\",\"Erhöhung\",IF(H35=\"6 Jungfrau\",\"Fall\",IF(OR(H35=\"8 Skorpion\",H35=\"1 Widder\"),\"Exil\",0))))","v":0},0,0,0,0]
["Zufriedenheit, Eitelkeit. Persönliche Freiheit, die durch Geld",null,null,null,null,{"$f":"IF($B$13=\"2. Haus\",\"8 Merkur\",0)","v":0},0,{"$f":"IF(F36<>0,$C$13,0)","v":0},0,{"$f":"IF(H36=\"3 Zwillinge\",\"Herrscher\",IF(H36=\"6 Jungfrau\",\"Herrscher u. Erhöhung\",IF(H36=\"12 Fische\",\"Fall u. Exil\",IF(H36=\"9 Schütze\",\"Exil\",0))))","v":0},0,0,0,0]
[" erlangt oder nicht erlangt wird. ",null,null,null,null,{"$f":"IF($B$14=\"2. Haus\",\"9 Mond\",0)","v":0},0,{"$f":"IF(F37<>0,$C$14,0)","v":0},0,{"$f":"IF(H37=\"4 Krebs\",\"Herrscher\",IF(H37=\"2 Stier\",\"Erhöhung\",IF(H37=\"8 Skorpion\",\"Fall\",IF(H37=\"10 Steinbock\",\"Exil\",0))))","v":0},0,0,0,0]
[null,null,null,null,null,{"$f":"IF($B$15=\"2. Haus\",\"Uranus\",0)","v":0},0,{"$f":"IF(F38<>0,$C$15,0)","v":0},0,{"$f":"IF(H38=\"11 Wassermann\",\"Herrscher\",IF(H38=\"5 Löwe\",\"Exil\",0))","v":0},0,0,0,0]
[null,null,null,null,null,{"$f":"IF($B$16=\"2. Haus\",\"Neptun\",0)","v":0},0,{"$f":"IF(F39<>0,$C$16,0)","v":0},0,{"$f":"IF(H39=\"12 Fische\",\"Herrscher\",IF(H39=\"6 Jungfrau\",\"Exil\",0))","v":0},0,0,0,0]
[null,null,null,null,null,{"$f":"IF($B$17=\"2. Haus\",\"Pluto\",0)","v":0},0,{"$f":"IF(F40<>0,$C$17,0)","v":0},0,{"$f":"IF(H40=\"8 Skorpion\",\"Herrscher\",IF(H40=\"2 Stier\",\"Exil\",0))","v":0},0,0,0,0]
["3. Haus: ` Unmittelbare Interessen und Beziehungen",{"$f":"F10","v":"5 Löwe"},{"$f":"IF(B41=\"1 Widder\",\"4 Der Herrscher\",IF(B41=\"2 Stier\",\"5 Der Hierophant\",IF(B41=\"3 Zwillinge\",\"6 Die Liebenden\",IF(B41=\"4 Krebs\",\"7 Der Wagen\",IF(B41=\"5 Löwe\",\"8 Die Kraft\",IF(B41=\"6 Jungfrau\",\"9 Der Eremit\",IF(B41=\"7 Waage\",\"11 Die Gerechtigkeit\",IF(B41=\"8 Skorpion\",\"13 Der Tod\",IF(B41=\"9 Schütze\",\"14 Die Mässigkeit\",IF(B41=\"10 Steinbock\",\"15 Der Teufel\",IF(B41=\"11 Wassermann\",\"17 Der Stern\",IF(B41=\"12 Fische\",\"18 Der Mond\"))))))))))))","v":"8 Die Kraft"},{"$f":"IF(B41=\"1 Widder\",\"5 Mars\",IF(B41=\"2 Stier\",\"7 Venus\",IF(B41=\"3 Zwillinge\",\"8 Merkur\",IF(B41=\"4 Krebs\",\"9 Mond\",IF(B41=\"5 Löwe\",\"6 Sonne\",IF(B41=\"6 Jungfrau\",\"8 Merkur\",IF(B41=\"7 Waage\",\"7 Venus\",IF(B41=\"8 Skorpion\",\"5 Mars\",IF(B41=\"9 Schütze\",\"4 Jupiter\",IF(B41=\"10 Steinbock\",\"3 Saturn\",IF(B41=\"11 Wassermann\",\"3 Saturn\",IF(B41=\"12 Fische\",\"4 Jupiter\"))))))))))))","v":"6 Sonne"},{"$f":"IF(D41=\"3 Saturn\",\"21 Die Welt\",IF(D41=\"4 Jupiter\",\"10 Das Rad\",IF(D41=\"5 Mars\",\"16 Der Turm\",IF(D41=\"6 Sonne\",\"19 Die Sonne\",IF(D41=\"7 Venus\",\"3 Die Herrscherin\",IF(D41=\"8 Merkur\",\"1 Der Magier\",IF(D41=\"9 Mond\",\"2 Die Hohepriesterin\",IF(D41=0,0))))))))","v":"19 Die Sonne"},{"$f":"IF($B$8=\"3. Haus\",\"3 Saturn\",0)","v":0},0,{"$f":"IF(F41<>0,$C$8,0)","v":0},0,{"$f":"IF(OR(H41=\"10 Steinbock\",H41=\"11 Wassermann\"),\"Herrscher\",IF(H41=\"7 Waage\",\"Erhöhung\",IF(H41=\"1 Widder\",\"Fall\",IF(OR(H41=\"4 Krebs\",H41=\"5 Löwe\"),\"Exil\",0))))","v":0},{"$f":"IF(G41<>0,D8,0)","v":0},0,0,{"$f":"IF(OR(H41=\"1 Widder\",H41=\"5 Löwe\",H41=\"9 Schütze\"),\"Stäbe\",IF(OR(H41=\"2 Stier\",H41=\"6 Jungfrau\",H41=\"10 Steinbock\"),\"Münzen\",IF(OR(H41=\"3 Zwillinge\",H41=\"7 Waage\",H41=\"11 Wassermann\"),\"Schwerter\",IF(OR(H41=\"4 Krebs\",H41=\"8 Skorpion\",H41=\"12 Fische\"),\"Kelche\",0))))","v":0}]
["Ich denke. ",null,null,{"$f":"IF(B41=\"8 Skorpion\",\"Pluto\",IF(B41=\"11 Wassermann\",\"Uranus\",IF(B41=\"12 Fische\",\"Neptun\",0)))","v":0},{"$f":"IF(D42=\"Pluto\",\"20 Das Gericht\",IF(D42=\"Uranus\",\"0 Der Narr\",IF(D42=\"Neptun\",\"12 Der Gehängte\",0)))","v":0},{"$f":"IF($B$9=\"3. Haus\",\"4 Jupiter\",0)","v":0},0,{"$f":"IF(F42<>0,$C$9,0)","v":0},0,{"$f":"IF(OR(H42=\"9 Schütze\",H42=\"12 Fische\"),\"Herrscher\",IF(H42=\"4 Krebs\",\"Erhöhung\",IF(H42=\"10 Steinbock\",\"Fall\",IF(OR(H42=\"3 Zwillinge\",H42=\"6 Jungfrau\"),\"Exil\",0))))","v":0},{"$f":"IF(G42<>0,D9,0)","v":0},0,0,0]
["Das Denken, Studieren, Lernen, Reden, Vortragen.",null,null,null,null,{"$f":"IF($B$10=\"3. Haus\",\"5 Mars\",0)","v":0},0,{"$f":"IF(F43<>0,$C$10,0)","v":0},0,{"$f":"IF(OR(H43=\"1 Widder\",H43=\"8 Skorpion\"),\"Herrscher\",IF(H43=\"10 Steinbock\",\"Erhöhung\",IF(H43=\"4 Krebs\",\"Fall\",IF(OR(H43=\"2 Stier\",H43=\"7 Waage\"),\"Exil\",0))))","v":0},0,0,0,0]
[" Kommunikation, Medien, intellektuelle Fähigkeiten. Kurze ",null,null,null,null,{"$f":"IF($B$11=\"3. Haus\",\"6 Sonne\",0)","v":0},0,{"$f":"IF(F44<>0,$C$11,0)","v":0},0,{"$f":"IF(H44=\"5 Löwe\",\"Herrscher\",0)","v":0},0,0,0,0]
["Reisen, Geschäftsreisen. Die Fähigkeit, sich in das Umfeld ",null,null,null,null,{"$f":"IF($B$12=\"3. Haus\",\"7 Venus\",0)","v":0},0,{"$f":"IF(F45<>0,$C$12,0)","v":0},0,{"$f":"IF(OR(H45=\"2 Stier\",H45=\"7 Waage\"),\"Herrscher\",IF(H45=\"12 Fische\",\"Erhöhung\",IF(H45=\"6 Jungfrau\",\"Fall\",IF(OR(H45=\"8 Skorpion\",H45=\"1 Widder\"),\"Exil\",0))))","v":0},0,0,0,0]
["zu integrieren. Brüder und Schwestern, Nachbarn. Alltag, ",null,null,null,null,{"$f":"IF($B$13=\"3. Haus\",\"8 Merkur\",0)","v":0},0,{"$f":"IF(F46<>0,$C$13,0)","v":0},0,{"$f":"IF(H46=\"3 Zwillinge\",\"Herrscher\",IF(H46=\"6 Jungfrau\",\"Herrscher u. Erhöhung\",IF(H46=\"12 Fische\",\"Fall u. Exil\",IF(H46=\"9 Schütze\",\"Exil\",0))))","v":0},0,0,0,0]
["gesunder Menschenverstand, Schriften, geistige Vorlieben. ",null,null,null,null,{"$f":"IF($B$14=\"3. Haus\",\"9 Mond\",0)","v":0},0,{"$f":"IF(F47<>0,$C$14,0)","v":0},0,{"$f":"IF(H47=\"4 Krebs\",\"Herrscher\",IF(H47=\"2 Stier\",\"Erhöhung\",IF(H47=\"8 Skorpion\",\"Fall\",IF(H47=\"10 Steinbock\",\"Exil\",0))))","v":0},0,0,0,0]
["Die Fähigkeit auf neue Situationen zu reagieren.",null,null,null,null,{"$f":"IF($B$15=\"3. Haus\",\"Uranus\",0)","v":0},0,{"$f":"IF(F48<>0,$C$15,0)","v":0},0,{"$f":"IF(H48=\"11 Wassermann\",\"Herrscher\",IF(H48=\"5 Löwe\",\"Exil\",0))","v":0},0,0,0,0]
[null,null,null,null,null,{"$f":"IF($B$16=\"3. Haus\",\"Neptun\",0)","v":0},0,{"$f":"IF(F49<>0,$C$16,0)","v":0},0,{"$f":"IF(H49=\"12 Fische\",\"Herrscher\",IF(H49=\"6 Jungfrau\",\"Exil\",0))","v":0},0,0,0,0]
[null,null,null,null,null,{"$f":"IF($B$17=\"3. Haus\",\"Pluto\",0)","v":0},0,{"$f":"IF(F50<>0,$C$17,0)","v":0},0,{"$f":"IF(H50=\"8 Skorpion\",\"Herrscher\",IF(H50=\"2 Stier\",\"Exil\",0))","v":0},0,0,0,0]
["4. Haus: a Herkunft und Familie (Imum Coeli)",{"$f":"F11","v":"6 Jungfrau"},{"$f":"IF(B51=\"1 Widder\",\"4 Der Herrscher\",IF(B51=\"2 Stier\",\"5 Der Hierophant\",IF(B51=\"3 Zwillinge\",\"6 Die Liebenden\",IF(B51=\"4 Krebs\",\"7 Der Wagen\",IF(B51=\"5 Löwe\",\"8 Die Kraft\",IF(B51=\"6 Jungfrau\",\"9 Der Eremit\",IF(B51=\"7 Waage\",\"11 Die Gerechtigkeit\",IF(B51=\"8 Skorpion\",\"13 Der Tod\",IF(B51=\"9 Schütze\",\"14 Die Mässigkeit\",IF(B51=\"10 Steinbock\",\"15 Der Teufel\",IF(B51=\"11 Wassermann\",\"17 Der Stern\",IF(B51=\"12 Fische\",\"18 Der Mond\"))))))))))))","v":"9 Der Eremit"},{"$f":"IF(B51=\"1 Widder\",\"5 Mars\",IF(B51=\"2 Stier\",\"7 Venus\",IF(B51=\"3 Zwillinge\",\"8 Merkur\",IF(B51=\"4 Krebs\",\"9 Mond\",IF(B51=\"5 Löwe\",\"6 Sonne\",IF(B51=\"6 Jungfrau\",\"8 Merkur\",IF(B51=\"7 Waage\",\"7 Venus\",IF(B51=\"8 Skorpion\",\"5 Mars\",IF(B51=\"9 Schütze\",\"4 Jupiter\",IF(B51=\"10 Steinbock\",\"3 Saturn\",IF(B51=\"11 Wassermann\",\"3 Saturn\",IF(B51=\"12 Fische\",\"4 Jupiter\"))))))))))))","v":"8 Merkur"},{"$f":"IF(D51=\"3 Saturn\",\"21 Die Welt\",IF(D51=\"4 Jupiter\",\"10 Das Rad\",IF(D51=\"5 Mars\",\"16 Der Turm\",IF(D51=\"6 Sonne\",\"19 Die Sonne\",IF(D51=\"7 Venus\",\"3 Die Herrscherin\",IF(D51=\"8 Merkur\",\"1 Der Magier\",IF(D51=\"9 Mond\",\"2 Die Hohepriesterin\",IF(D51=0,0))))))))","v":"1 Der Magier"},{"$f":"IF($B$8=\"4. Haus\",\"3 Saturn\",0)","v":0},0,{"$f":"IF(F51<>0,$C$8,0)","v":0},0,{"$f":"IF(OR(H51=\"10 Steinbock\",H51=\"11 Wassermann\"),\"Herrscher\",IF(H51=\"7 Waage\",\"Erhöhung\",IF(H51=\"1 Widder\",\"Fall\",IF(OR(H51=\"4 Krebs\",H51=\"5 Löwe\"),\"Exil\",0))))","v":0},{"$f":"IF(G51<>0,D8,0)","v":0},0,0,{"$f":"IF(OR(H51=\"1 Widder\",H51=\"5 Löwe\",H51=\"9 Schütze\"),\"Stäbe\",IF(OR(H51=\"2 Stier\",H51=\"6 Jungfrau\",H51=\"10 Steinbock\"),\"Münzen\",IF(OR(H51=\"3 Zwillinge\",H51=\"7 Waage\",H51=\"11 Wassermann\"),\"Schwerter\",IF(OR(H51=\"4 Krebs\",H51=\"8 Skorpion\",H51=\"12 Fische\"),\"Kelche\",0))))","v":0}]
["Ich bin geborgen. ",null,null,{"$f":"IF(B51=\"8 Skorpion\",\"Pluto\",IF(B51=\"11 Wassermann\",\"Uranus\",IF(B51=\"12 Fische\",\"Neptun\",0)))","v":0},{"$f":"IF(D52=\"Pluto\",\"20 Das Gericht\",IF(D52=\"Uranus\",\"0 Der Narr\",IF(D52=\"Neptun\",\"12 Der Gehängte\",0)))","v":0},{"$f":"IF($B$9=\"4. Haus\",\"4 Jupiter\",0)","v":0},0,{"$f":"IF(F52<>0,$C$9,0)","v":0},0,{"$f":"IF(OR(H52=\"9 Schütze\",H52=\"12 Fische\"),\"Herrscher\",IF(H52=\"4 Krebs\",\"Erhöhung\",IF(H52=\"10 Steinbock\",\"Fall\",IF(OR(H52=\"3 Zwillinge\",H52=\"6 Jungfrau\"),\"Exil\",0))))","v":0},{"$f":"IF(G52<>0,D9,0)","v":0},0,0,0]
["Erbliche Anlagen. Das Zuhause, die Eltern, die Herkunft, ",null,null,null,null,{"$f":"IF($B$10=\"4. Haus\",\"5 Mars\",0)","v":0},0,{"$f":"IF(F53<>0,$C$10,0)","v":0},0,{"$f":"IF(OR(H53=\"1 Widder\",H53=\"8 Skorpion\"),\"Herrscher\",IF(H53=\"10 Steinbock\",\"Erhöhung\",IF(H53=\"4 Krebs\",\"Fall\",IF(OR(H53=\"2 Stier\",H53=\"7 Waage\"),\"Exil\",0))))","v":0},0,0,{"$f":"IF(AND(L53=\"Kardinal\",K53=\"1. Dekanat\"),2,IF(AND(L53=\"Kardinal\",K53=\"2. Dekanat\"),3,IF(AND(L53=\"Kardinal\",K53=\"3. Dekanat\"),4,IF(AND(L53=\"Fix\",K53=\"1. Dekanat\"),5,IF(AND(L53=\"Fix\",K53=\"2. Dekanat\"),6,IF(AND(L53=\"Fix\",K53=\"3. Dekanat\"),7,IF(AND(L53=\"Veränderlich\",K53=\"1. Dekanat\"),8,IF(AND(L53=\"Veränderlich\",K53=\"2. Dekanat\"),9,IF(AND(L53=\"Veränderlich\",K53=\"3. Dekanat\"),10,0)))))))))","v":0},0]
["physische und psychische Geborgenheit, die Familie, ",null,null,null,null,{"$f":"IF($B$11=\"4. Haus\",\"6 Sonne\",0)","v":0},0,{"$f":"IF(F54<>0,$C$11,0)","v":0},0,{"$f":"IF(H54=\"5 Löwe\",\"Herrscher\",0)","v":0},0,0,0,0]
["emotionale Wurzeln, häusliche Angelegenheiten, die",null,null,null,null,{"$f":"IF($B$12=\"4. Haus\",\"7 Venus\",0)","v":0},0,{"$f":"IF(F55<>0,$C$12,0)","v":0},0,{"$f":"IF(OR(H55=\"2 Stier\",H55=\"7 Waage\"),\"Herrscher\",IF(H55=\"12 Fische\",\"Erhöhung\",IF(H55=\"6 Jungfrau\",\"Fall\",IF(OR(H55=\"8 Skorpion\",H55=\"1 Widder\"),\"Exil\",0))))","v":0},0,0,0,0]
[" häusliche Umgebung, Immobilien, familiäre Themen, ",null,null,null,null,{"$f":"IF($B$13=\"4. Haus\",\"8 Merkur\",0)","v":0},0,{"$f":"IF(F56<>0,$C$13,0)","v":0},0,{"$f":"IF(H56=\"3 Zwillinge\",\"Herrscher\",IF(H56=\"6 Jungfrau\",\"Herrscher u. Erhöhung\",IF(H56=\"12 Fische\",\"Fall u. Exil\",IF(H56=\"9 Schütze\",\"Exil\",0))))","v":0},0,0,0,0]
["Liegenschaften, seelische Prägungen, der Elternteil, zu dem ",null,null,null,null,{"$f":"IF($B$14=\"4. Haus\",\"9 Mond\",0)","v":"9 Mond"},"2 Die Hohepriesterin",{"$f":"IF(F57<>0,$C$14,0)","v":"6 Jungfrau"},"9 Der Eremit",{"$f":"IF(H57=\"4 Krebs\",\"Herrscher\",IF(H57=\"2 Stier\",\"Erhöhung\",IF(H57=\"8 Skorpion\",\"Fall\",IF(H57=\"10 Steinbock\",\"Exil\",0))))","v":0},"3. Dekanat","Veränderlich",10,"Münzen"]
["man eine stärkere Bindung hat. Das Alter, die letzten Jahre ",null,null,null,null,{"$f":"IF($B$15=\"4. Haus\",\"Uranus\",0)","v":0},0,{"$f":"IF(F58<>0,$C$15,0)","v":0},0,{"$f":"IF(H58=\"11 Wassermann\",\"Herrscher\",IF(H58=\"5 Löwe\",\"Exil\",0))","v":0},0,0,{"$f":"IF(AND(L58=\"Kardinal\",K58=\"1. Dekanat\"),2,IF(AND(L58=\"Kardinal\",K58=\"2. Dekanat\"),3,IF(AND(L58=\"Kardinal\",K58=\"3. Dekanat\"),4,IF(AND(L58=\"Fix\",K58=\"1. Dekanat\"),5,IF(AND(L58=\"Fix\",K58=\"2. Dekanat\"),6,IF(AND(L58=\"Fix\",K58=\"3. Dekanat\"),7,IF(AND(L58=\"Veränderlich\",K58=\"1. Dekanat\"),8,IF(AND(L58=\"Veränderlich\",K58=\"2. Dekanat\"),9,IF(AND(L58=\"Veränderlich\",K58=\"3. Dekanat\"),10,0)))))))))","v":0},0]
["vor dem Tod.",null,null,null,null,{"$f":"IF($B$16=\"4. Haus\",\"Neptun\",0)","v":0},0,{"$f":"IF(F59<>0,$C$16,0)","v":0},0,{"$f":"IF(H59=\"12 Fische\",\"Herrscher\",IF(H59=\"6 Jungfrau\",\"Exil\",0))","v":0},0,0,0,0]
[null,null,null,null,null,{"$f":"IF($B$17=\"4. Haus\",\"Pluto\",0)","v":0},0,{"$f":"IF(F60<>0,$C$17,0)","v":0},0,{"$f":"IF(H60=\"8 Skorpion\",\"Herrscher\",IF(H60=\"2 Stier\",\"Exil\",0))","v":0},0,0,0,0]
["5. Haus: b Kreativität und Vergnügen",{"$f":"F12","v":"7 Waage"},{"$f":"IF(B61=\"1 Widder\",\"4 Der Herrscher\",IF(B61=\"2 Stier\",\"5 Der Hierophant\",IF(B61=\"3 Zwillinge\",\"6 Die Liebenden\",IF(B61=\"4 Krebs\",\"7 Der Wagen\",IF(B61=\"5 Löwe\",\"8 Die Kraft\",IF(B61=\"6 Jungfrau\",\"9 Der Eremit\",IF(B61=\"7 Waage\",\"11 Die Gerechtigkeit\",IF(B61=\"8 Skorpion\",\"13 Der Tod\",IF(B61=\"9 Schütze\",\"14 Die Mässigkeit\",IF(B61=\"10 Steinbock\",\"15 Der Teufel\",IF(B61=\"11 Wassermann\",\"17 Der Stern\",IF(B61=\"12 Fische\",\"18 Der Mond\"))))))))))))","v":"11 Die Gerechtigkeit"},{"$f":"IF(B61=\"1 Widder\",\"5 Mars\",IF(B61=\"2 Stier\",\"7 Venus\",IF(B61=\"3 Zwillinge\",\"8 Merkur\",IF(B61=\"4 Krebs\",\"9 Mond\",IF(B61=\"5 Löwe\",\"6 Sonne\",IF(B61=\"6 Jungfrau\",\"8 Merkur\",IF(B61=\"7 Waage\",\"7 Venus\",IF(B61=\"8 Skorpion\",\"5 Mars\",IF(B61=\"9 Schütze\",\"4 Jupiter\",IF(B61=\"10 Steinbock\",\"3 Saturn\",IF(B61=\"11 Wassermann\",\"3 Saturn\",IF(B61=\"12 Fische\",\"4 Jupiter\"))))))))))))","v":"7 Venus"},{"$f":"IF(D61=\"3 Saturn\",\"21 Die Welt\",IF(D61=\"4 Jupiter\",\"10 Das Rad\",IF(D61=\"5 Mars\",\"16 Der Turm\",IF(D61=\"6 Sonne\",\"19 Die Sonne\",IF(D61=\"7 Venus\",\"3 Die Herrscherin\",IF(D61=\"8 Merkur\",\"1 Der Magier\",IF(D61=\"9 Mond\",\"2 Die Hohepriesterin\",IF(D61=0,0))))))))","v":"3 Die Herrscherin"},{"$f":"IF($B$8=\"5. Haus\",\"3 Saturn\",0)","v":0},0,{"$f":"IF(F61<>0,$C$8,0)","v":0},0,{"$f":"IF(OR(H61=\"10 Steinbock\",H61=\"11 Wassermann\"),\"Herrscher\",IF(H61=\"7 Waage\",\"Erhöhung\",IF(H61=\"1 Widder\",\"Fall\",IF(OR(H61=\"4 Krebs\",H61=\"5 Löwe\"),\"Exil\",0))))","v":0},{"$f":"IF(G61<>0,D8,0)","v":0},0,0,{"$f":"IF(OR(H61=\"1 Widder\",H61=\"5 Löwe\",H61=\"9 Schütze\"),\"Stäbe\",IF(OR(H61=\"2 Stier\",H61=\"6 Jungfrau\",H61=\"10 Steinbock\"),\"Münzen\",IF(OR(H61=\"3 Zwillinge\",H61=\"7 Waage\",H61=\"11 Wassermann\"),\"Schwerter\",IF(OR(H61=\"4 Krebs\",H61=\"8 Skorpion\",H61=\"12 Fische\"),\"Kelche\",0))))","v":0}]
["Ich mag, ich spiele. ",null,null,{"$f":"IF(B61=\"8 Skorpion\",\"Pluto\",IF(B61=\"11 Wassermann\",\"Uranus\",IF(B61=\"12 Fische\",\"Neptun\",0)))","v":0},{"$f":"IF(D62=\"Pluto\",\"20 Das Gericht\",IF(D62=\"Uranus\",\"0 Der Narr\",IF(D62=\"Neptun\",\"12 Der Gehängte\",0)))","v":0},{"$f":"IF($B$9=\"5. Haus\",\"4 Jupiter\",0)","v":0},0,{"$f":"IF(F62<>0,$C$9,0)","v":0},0,{"$f":"IF(OR(H62=\"9 Schütze\",H62=\"12 Fische\"),\"Herrscher\",IF(H62=\"4 Krebs\",\"Erhöhung\",IF(H62=\"10 Steinbock\",\"Fall\",IF(OR(H62=\"3 Zwillinge\",H62=\"6 Jungfrau\"),\"Exil\",0))))","v":0},{"$f":"IF(G62<>0,D9,0)","v":0},0,0,{"$f":"IF(OR(H62=\"1 Widder\",H62=\"5 Löwe\",H62=\"9 Schütze\"),\"Stäbe\",IF(OR(H62=\"2 Stier\",H62=\"6 Jungfrau\",H62=\"10 Steinbock\"),\"Münzen\",IF(OR(H62=\"3 Zwillinge\",H62=\"7 Waage\",H62=\"11 Wassermann\"),\"Schwerter\",IF(OR(H62=\"4 Krebs\",H62=\"8 Skorpion\",H62=\"12 Fische\"),\"Kelche\",0))))","v":0}]
["Kreativer Ausdruck, Selbstausdruck, Hobbys, ",null,null,null,null,{"$f":"IF($B$10=\"5. Haus\",\"5 Mars\",0)","v":0},0,{"$f":"IF(F63<>0,$C$10,0)","v":0},0,{"$f":"IF(OR(H63=\"1 Widder\",H63=\"8 Skorpion\"),\"Herrscher\",IF(H63=\"10 Steinbock\",\"Erhöhung\",IF(H63=\"4 Krebs\",\"Fall\",IF(OR(H63=\"2 Stier\",H63=\"7 Waage\"),\"Exil\",0))))","v":0},0,0,0,0]
["Nebenerwerb, Spiel und Spass, Vergnügen. Fortpflanzung ",null,null,null,null,{"$f":"IF($B$11=\"5. Haus\",\"6 Sonne\",0)","v":0},0,{"$f":"IF(F64<>0,$C$11,0)","v":0},0,{"$f":"IF(H64=\"5 Löwe\",\"Herrscher\",0)","v":0},0,{"$f":"IF(OR(H64=\"1 Widder\",H64=\"4 Krebs\",H64=\"7 Waage\",H64=\"10 Steinbock\"),\"Kardinal\",IF(OR(H64=\"2 Stier\",H64=\"5 Löwe\",H64=\"8 Skorpion\",H64=\"11 Wassermann\"),\"Fix\",IF(OR(H64=\"3 Zwillinge\",H64=\"6 Jungfrau\",H64=\"9 Schütze\",H64=\"12 Fische\"),\"Veränderlich\",0)))","v":0},0,0]
["und Kinder. Liebesaffären, Romanzen. Urlaub, Abenteuer, ",null,null,null,null,{"$f":"IF($B$12=\"5. Haus\",\"7 Venus\",0)","v":0},0,{"$f":"IF(F65<>0,$C$12,0)","v":0},0,{"$f":"IF(OR(H65=\"2 Stier\",H65=\"7 Waage\"),\"Herrscher\",IF(H65=\"12 Fische\",\"Erhöhung\",IF(H65=\"6 Jungfrau\",\"Fall\",IF(OR(H65=\"8 Skorpion\",H65=\"1 Widder\"),\"Exil\",0))))","v":0},0,0,0,0]
["Spekulationen, Glücksspiele, Unterhaltung, Kunst, Sport. ",null,null,null,null,{"$f":"IF($B$13=\"5. Haus\",\"8 Merkur\",0)","v":0},0,{"$f":"IF(F66<>0,$C$13,0)","v":0},0,{"$f":"IF(H66=\"3 Zwillinge\",\"Herrscher\",IF(H66=\"6 Jungfrau\",\"Herrscher u. Erhöhung\",IF(H66=\"12 Fische\",\"Fall u. Exil\",IF(H66=\"9 Schütze\",\"Exil\",0))))","v":0},0,0,0,0]
[null,null,null,null,null,{"$f":"IF($B$14=\"5. Haus\",\"9 Mond\",0)","v":0},0,{"$f":"IF(F67<>0,$C$14,0)","v":0},0,{"$f":"IF(H67=\"4 Krebs\",\"Herrscher\",IF(H67=\"2 Stier\",\"Erhöhung\",IF(H67=\"8 Skorpion\",\"Fall\",IF(H67=\"10 Steinbock\",\"Exil\",0))))","v":0},0,0,0,0]
[null,null,null,null,null,{"$f":"IF($B$15=\"5. Haus\",\"Uranus\",0)","v":0},0,{"$f":"IF(F68<>0,$C$15,0)","v":0},0,{"$f":"IF(H68=\"11 Wassermann\",\"Herrscher\",IF(H68=\"5 Löwe\",\"Exil\",0))","v":0},0,0,0,0]
[null,null,null,null,null,{"$f":"IF($B$16=\"5. Haus\",\"Neptun\",0)","v":0},0,{"$f":"IF(F69<>0,$C$16,0)","v":0},0,{"$f":"IF(H69=\"12 Fische\",\"Herrscher\",IF(H69=\"6 Jungfrau\",\"Exil\",0))","v":0},0,0,0,0]
[null,null,null,null,null,{"$f":"IF($B$17=\"5. Haus\",\"Pluto\",0)","v":"Pluto"},"20 Das Gericht",{"$f":"IF(F70<>0,$C$17,0)","v":"8 Skorpion"},"13 Der Tod",{"$f":"IF(H70=\"8 Skorpion\",\"Herrscher\",IF(H70=\"2 Stier\",\"Exil\",0))","v":"Herrscher"},"2. Dekanat","Fix",6,"Kelche"]
["6. Haus: c Alltag und Arbeit",{"$f":"F13","v":"9 Schütze"},{"$f":"IF(B71=\"1 Widder\",\"4 Der Herrscher\",IF(B71=\"2 Stier\",\"5 Der Hierophant\",IF(B71=\"3 Zwillinge\",\"6 Die Liebenden\",IF(B71=\"4 Krebs\",\"7 Der Wagen\",IF(B71=\"5 Löwe\",\"8 Die Kraft\",IF(B71=\"6 Jungfrau\",\"9 Der Eremit\",IF(B71=\"7 Waage\",\"11 Die Gerechtigkeit\",IF(B71=\"8 Skorpion\",\"13 Der Tod\",IF(B71=\"9 Schütze\",\"14 Die Mässigkeit\",IF(B71=\"10 Steinbock\",\"15 Der Teufel\",IF(B71=\"11 Wassermann\",\"17 Der Stern\",IF(B71=\"12 Fische\",\"18 Der Mond\"))))))))))))","v":"14 Die Mässigkeit"},{"$f":"IF(B71=\"1 Widder\",\"5 Mars\",IF(B71=\"2 Stier\",\"7 Venus\",IF(B71=\"3 Zwillinge\",\"8 Merkur\",IF(B71=\"4 Krebs\",\"9 Mond\",IF(B71=\"5 Löwe\",\"6 Sonne\",IF(B71=\"6 Jungfrau\",\"8 Merkur\",IF(B71=\"7 Waage\",\"7 Venus\",IF(B71=\"8 Skorpion\",\"5 Mars\",IF(B71=\"9 Schütze\",\"4 Jupiter\",IF(B71=\"10 Steinbock\",\"3 Saturn\",IF(B71=\"11 Wassermann\",\"3 Saturn\",IF(B71=\"12 Fische\",\"4 Jupiter\"))))))))))))","v":"4 Jupiter"},{"$f":"IF(D71=\"3 Saturn\",\"21 Die Welt\",IF(D71=\"4 Jupiter\",\"10 Das Rad\",IF(D71=\"5 Mars\",\"16 Der Turm\",IF(D71=\"6 Sonne\",\"19 Die Sonne\",IF(D71=\"7 Venus\",\"3 Die Herrscherin\",IF(D71=\"8 Merkur\",\"1 Der Magier\",IF(D71=\"9 Mond\",\"2 Die Hohepriesterin\",IF(D71=0,0))))))))","v":"10 Das Rad"},{"$f":"IF($B$8=\"6. Haus\",\"3 Saturn\",0)","v":0},0,{"$f":"IF(F71<>0,$C$8,0)","v":0},0,{"$f":"IF(OR(H71=\"10 Steinbock\",H71=\"11 Wassermann\"),\"Herrscher\",IF(H71=\"7 Waage\",\"Erhöhung\",IF(H71=\"1 Widder\",\"Fall\",IF(OR(H71=\"4 Krebs\",H71=\"5 Löwe\"),\"Exil\",0))))","v":0},{"$f":"IF(G71<>0,D8,0)","v":0},0,{"$f":"IF(AND(L71=\"Kardinal\",K71=\"1. Dekanat\"),2,IF(AND(L71=\"Kardinal\",K71=\"2. Dekanat\"),3,IF(AND(L71=\"Kardinal\",K71=\"3. Dekanat\"),4,IF(AND(L71=\"Fix\",K71=\"1. Dekanat\"),5,IF(AND(L71=\"Fix\",K71=\"2. Dekanat\"),6,IF(AND(L71=\"Fix\",K71=\"3. Dekanat\"),7,IF(AND(L71=\"Veränderlich\",K71=\"1. Dekanat\"),8,IF(AND(L71=\"Veränderlich\",K71=\"2. Dekanat\"),9,IF(AND(L71=\"Veränderlich\",K71=\"3. Dekanat\"),10,0)))))))))","v":0},{"$f":"IF(OR(H71=\"1 Widder\",H71=\"5 Löwe\",H71=\"9 Schütze\"),\"Stäbe\",IF(OR(H71=\"2 Stier\",H71=\"6 Jungfrau\",H71=\"10 Steinbock\"),\"Münzen\",IF(OR(H71=\"3 Zwillinge\",H71=\"7 Waage\",H71=\"11 Wassermann\"),\"Schwerter\",IF(OR(H71=\"4 Krebs\",H71=\"8 Skorpion\",H71=\"12 Fische\"),\"Kelche\",0))))","v":0}]
["Ich arbeite. ",null,null,{"$f":"IF(B71=\"8 Skorpion\",\"Pluto\",IF(B71=\"11 Wassermann\",\"Uranus\",IF(B71=\"12 Fische\",\"Neptun\",0)))","v":0},{"$f":"IF(D72=\"Pluto\",\"20 Das Gericht\",IF(D72=\"Uranus\",\"0 Der Narr\",IF(D72=\"Neptun\",\"12 Der Gehängte\",0)))","v":0},{"$f":"IF($B$9=\"6. Haus\",\"4 Jupiter\",0)","v":0},0,{"$f":"IF(F72<>0,$C$9,0)","v":0},0,{"$f":"IF(OR(H72=\"9 Schütze\",H72=\"12 Fische\"),\"Herrscher\",IF(H72=\"4 Krebs\",\"Erhöhung\",IF(H72=\"10 Steinbock\",\"Fall\",IF(OR(H72=\"3 Zwillinge\",H72=\"6 Jungfrau\"),\"Exil\",0))))","v":0},{"$f":"IF(G72<>0,D9,0)","v":0},0,0,0]
["Selbstentwicklung. Gesundheit, Krankheit. Ernährung, ",null,null,null,null,{"$f":"IF($B$10=\"6. Haus\",\"5 Mars\",0)","v":0},0,{"$f":"IF(F73<>0,$C$10,0)","v":0},0,{"$f":"IF(OR(H73=\"1 Widder\",H73=\"8 Skorpion\"),\"Herrscher\",IF(H73=\"10 Steinbock\",\"Erhöhung\",IF(H73=\"4 Krebs\",\"Fall\",IF(OR(H73=\"2 Stier\",H73=\"7 Waage\"),\"Exil\",0))))","v":0},0,0,0,0]
["Kleidung, Hygiene. Arbeit, Arbeitgeber, Dienstleistung, ",null,null,null,null,{"$f":"IF($B$11=\"6. Haus\",\"6 Sonne\",0)","v":0},0,{"$f":"IF(F74<>0,$C$11,0)","v":0},0,{"$f":"IF(H74=\"5 Löwe\",\"Herrscher\",0)","v":0},0,0,0,0]
["Arbeitsalltag, Arbeitsplatz, soziales Verhalten, soziale ",null,null,null,null,{"$f":"IF($B$12=\"6. Haus\",\"7 Venus\",0)","v":0},0,{"$f":"IF(F75<>0,$C$12,0)","v":0},0,{"$f":"IF(OR(H75=\"2 Stier\",H75=\"7 Waage\"),\"Herrscher\",IF(H75=\"12 Fische\",\"Erhöhung\",IF(H75=\"6 Jungfrau\",\"Fall\",IF(OR(H75=\"8 Skorpion\",H75=\"1 Widder\"),\"Exil\",0))))","v":0},0,0,0,0]
["Integration, Anpassung. Umgang mit Kollegen, Vorgesetzten, ",null,null,null,null,{"$f":"IF($B$13=\"6. Haus\",\"8 Merkur\",0)","v":0},0,{"$f":"IF(F76<>0,$C$13,0)","v":0},0,{"$f":"IF(H76=\"3 Zwillinge\",\"Herrscher\",IF(H76=\"6 Jungfrau\",\"Herrscher u. Erhöhung\",IF(H76=\"12 Fische\",\"Fall u. Exil\",IF(H76=\"9 Schütze\",\"Exil\",0))))","v":0},0,0,0,0]
["Dienstpersonal und Angestellten. Kastendenken, ",null,null,null,null,{"$f":"IF($B$14=\"6. Haus\",\"9 Mond\",0)","v":0},0,{"$f":"IF(F77<>0,$C$14,0)","v":0},0,{"$f":"IF(H77=\"4 Krebs\",\"Herrscher\",IF(H77=\"2 Stier\",\"Erhöhung\",IF(H77=\"8 Skorpion\",\"Fall\",IF(H77=\"10 Steinbock\",\"Exil\",0))))","v":0},0,0,0,0]
["Standesbewusstsein, Gewohnheiten. Kleine Tiere, Haustiere. ",null,null,null,null,{"$f":"IF($B$15=\"6. Haus\",\"Uranus\",0)","v":"Uranus"},"0 Der Narr",{"$f":"IF(F78<>0,$C$15,0)","v":"10 Steinbock"},"15 Der Teufel",{"$f":"IF(H78=\"11 Wassermann\",\"Herrscher\",IF(H78=\"5 Löwe\",\"Exil\",0))","v":0},"1. Dekanat","Kardinal",2,"Münzen"]
["Interesse an einem gesunden Lebensstil. Onkel und Tanten.",null,null,null,null,{"$f":"IF($B$16=\"6. Haus\",\"Neptun\",0)","v":0},0,{"$f":"IF(F79<>0,$C$16,0)","v":0},0,{"$f":"IF(H79=\"12 Fische\",\"Herrscher\",IF(H79=\"6 Jungfrau\",\"Exil\",0))","v":0},0,0,{"$f":"IF(AND(L79=\"Kardinal\",K79=\"1. Dekanat\"),2,IF(AND(L79=\"Kardinal\",K79=\"2. Dekanat\"),3,IF(AND(L79=\"Kardinal\",K79=\"3. Dekanat\"),4,IF(AND(L79=\"Fix\",K79=\"1. Dekanat\"),5,IF(AND(L79=\"Fix\",K79=\"2. Dekanat\"),6,IF(AND(L79=\"Fix\",K79=\"3. Dekanat\"),7,IF(AND(L79=\"Veränderlich\",K79=\"1. Dekanat\"),8,IF(AND(L79=\"Veränderlich\",K79=\"2. Dekanat\"),9,IF(AND(L79=\"Veränderlich\",K79=\"3. Dekanat\"),10,0)))))))))","v":0},{"$f":"IF(OR(H79=\"1 Widder\",H79=\"5 Löwe\",H79=\"9 Schütze\"),\"Stäbe\",IF(OR(H79=\"2 Stier\",H79=\"6 Jungfrau\",H79=\"10 Steinbock\"),\"Münzen\",IF(OR(H79=\"3 Zwillinge\",H79=\"7 Waage\",H79=\"11 Wassermann\"),\"Schwerter\",IF(OR(H79=\"4 Krebs\",H79=\"8 Skorpion\",H79=\"12 Fische\"),\"Kelche\",0))))","v":0}]
[null,null,null,null,null,{"$f":"IF($B$17=\"6. Haus\",\"Pluto\",0)","v":0},0,{"$f":"IF(F80<>0,$C$17,0)","v":0},0,{"$f":"IF(H80=\"8 Skorpion\",\"Herrscher\",IF(H80=\"2 Stier\",\"Exil\",0))","v":0},0,0,0,0]
["7. Haus: d Beziehungen und Partnerschaft (Deszendent)",{"$f":"H8","v":"10 Steinbock"},{"$f":"IF(B81=\"1 Widder\",\"4 Der Herrscher\",IF(B81=\"2 Stier\",\"5 Der Hierophant\",IF(B81=\"3 Zwillinge\",\"6 Die Liebenden\",IF(B81=\"4 Krebs\",\"7 Der Wagen\",IF(B81=\"5 Löwe\",\"8 Die Kraft\",IF(B81=\"6 Jungfrau\",\"9 Der Eremit\",IF(B81=\"7 Waage\",\"11 Die Gerechtigkeit\",IF(B81=\"8 Skorpion\",\"13 Der Tod\",IF(B81=\"9 Schütze\",\"14 Die Mässigkeit\",IF(B81=\"10 Steinbock\",\"15 Der Teufel\",IF(B81=\"11 Wassermann\",\"17 Der Stern\",IF(B81=\"12 Fische\",\"18 Der Mond\"))))))))))))","v":"15 Der Teufel"},{"$f":"IF(B81=\"1 Widder\",\"5 Mars\",IF(B81=\"2 Stier\",\"7 Venus\",IF(B81=\"3 Zwillinge\",\"8 Merkur\",IF(B81=\"4 Krebs\",\"9 Mond\",IF(B81=\"5 Löwe\",\"6 Sonne\",IF(B81=\"6 Jungfrau\",\"8 Merkur\",IF(B81=\"7 Waage\",\"7 Venus\",IF(B81=\"8 Skorpion\",\"5 Mars\",IF(B81=\"9 Schütze\",\"4 Jupiter\",IF(B81=\"10 Steinbock\",\"3 Saturn\",IF(B81=\"11 Wassermann\",\"3 Saturn\",IF(B81=\"12 Fische\",\"4 Jupiter\"))))))))))))","v":"3 Saturn"},{"$f":"IF(D81=\"3 Saturn\",\"21 Die Welt\",IF(D81=\"4 Jupiter\",\"10 Das Rad\",IF(D81=\"5 Mars\",\"16 Der Turm\",IF(D81=\"6 Sonne\",\"19 Die Sonne\",IF(D81=\"7 Venus\",\"3 Die Herrscherin\",IF(D81=\"8 Merkur\",\"1 Der Magier\",IF(D81=\"9 Mond\",\"2 Die Hohepriesterin\",IF(D81=0,0))))))))","v":"21 Die Welt"},{"$f":"IF($B$8=\"7. Haus\",\"3 Saturn\",0)","v":"3 Saturn"},"21 Die Welt",{"$f":"IF(F81<>0,$C$8,0)","v":"10 Steinbock"},"15 Der Teufel",{"$f":"IF(OR(H81=\"10 Steinbock\",H81=\"11 Wassermann\"),\"Herrscher\",IF(H81=\"7 Waage\",\"Erhöhung\",IF(H81=\"1 Widder\",\"Fall\",IF(OR(H81=\"4 Krebs\",H81=\"5 Löwe\"),\"Exil\",0))))","v":"Herrscher"},{"$f":"IF(G81<>0,D8,0)","v":"2. Dekanat"},"Kardinal",3,"Münzen"]
["Ich liebe. ",null,null,{"$f":"IF(B81=\"8 Skorpion\",\"Pluto\",IF(B81=\"11 Wassermann\",\"Uranus\",IF(B81=\"12 Fische\",\"Neptun\",0)))","v":0},{"$f":"IF(D82=\"Pluto\",\"20 Das Gericht\",IF(D82=\"Uranus\",\"0 Der Narr\",IF(D82=\"Neptun\",\"12 Der Gehängte\",0)))","v":0},{"$f":"IF($B$9=\"7. Haus\",\"4 Jupiter\",0)","v":0},0,{"$f":"IF(F82<>0,$C$9,0)","v":0},0,{"$f":"IF(OR(H82=\"9 Schütze\",H82=\"12 Fische\"),\"Herrscher\",IF(H82=\"4 Krebs\",\"Erhöhung\",IF(H82=\"10 Steinbock\",\"Fall\",IF(OR(H82=\"3 Zwillinge\",H82=\"6 Jungfrau\"),\"Exil\",0))))","v":0},{"$f":"IF(G82<>0,D9,0)","v":0},0,{"$f":"IF(AND(L82=\"Kardinal\",K82=\"1. Dekanat\"),2,IF(AND(L82=\"Kardinal\",K82=\"2. Dekanat\"),3,IF(AND(L82=\"Kardinal\",K82=\"3. Dekanat\"),4,IF(AND(L82=\"Fix\",K82=\"1. Dekanat\"),5,IF(AND(L82=\"Fix\",K82=\"2. Dekanat\"),6,IF(AND(L82=\"Fix\",K82=\"3. Dekanat\"),7,IF(AND(L82=\"Veränderlich\",K82=\"1. Dekanat\"),8,IF(AND(L82=\"Veränderlich\",K82=\"2. Dekanat\"),9,IF(AND(L82=\"Veränderlich\",K82=\"3. Dekanat\"),10,0)))))))))","v":0},0]
["Beziehungen, geschäftliche und private Partnerschaften, Ehe,",null,null,null,null,{"$f":"IF($B$10=\"7. Haus\",\"5 Mars\",0)","v":0},0,{"$f":"IF(F83<>0,$C$10,0)","v":0},0,{"$f":"IF(OR(H83=\"1 Widder\",H83=\"8 Skorpion\"),\"Herrscher\",IF(H83=\"10 Steinbock\",\"Erhöhung\",IF(H83=\"4 Krebs\",\"Fall\",IF(OR(H83=\"2 Stier\",H83=\"7 Waage\"),\"Exil\",0))))","v":0},0,0,0,0]
["Begegnung mit dem Du. Trennungen, Scheidungen. ",null,null,null,null,{"$f":"IF($B$11=\"7. Haus\",\"6 Sonne\",0)","v":0},0,{"$f":"IF(F84<>0,$C$11,0)","v":0},0,{"$f":"IF(H84=\"5 Löwe\",\"Herrscher\",0)","v":0},0,0,0,{"$f":"IF(OR(H84=\"1 Widder\",H84=\"5 Löwe\",H84=\"9 Schütze\"),\"Stäbe\",IF(OR(H84=\"2 Stier\",H84=\"6 Jungfrau\",H84=\"10 Steinbock\"),\"Münzen\",IF(OR(H84=\"3 Zwillinge\",H84=\"7 Waage\",H84=\"11 Wassermann\"),\"Schwerter\",IF(OR(H84=\"4 Krebs\",H84=\"8 Skorpion\",H84=\"12 Fische\"),\"Kelche\",0))))","v":0}]
["Juristische Belange. Verträge und Vereinbarungen. ",null,null,null,null,{"$f":"IF($B$12=\"7. Haus\",\"7 Venus\",0)","v":0},0,{"$f":"IF(F85<>0,$C$12,0)","v":0},0,{"$f":"IF(OR(H85=\"2 Stier\",H85=\"7 Waage\"),\"Herrscher\",IF(H85=\"12 Fische\",\"Erhöhung\",IF(H85=\"6 Jungfrau\",\"Fall\",IF(OR(H85=\"8 Skorpion\",H85=\"1 Widder\"),\"Exil\",0))))","v":0},0,0,0,0]
["Zusammenarbeit oder Konkurrenz. Umgang mit anderen ",null,null,null,null,{"$f":"IF($B$13=\"7. Haus\",\"8 Merkur\",0)","v":0},{"$f":"IF(F86=\"3 Saturn\",\"21 Die Welt\",IF(F86=\"4 Jupiter\",\"10 Das Rad\",IF(F86=\"5 Mars\",\"16 Der Turm\",IF(F86=\"6 Sonne\",\"19 Die Sonne\",IF(F86=\"7 Venus\",\"3 Die Herrscherin\",IF(F86=\"8 Merkur\",\"1 Der Magier\",IF(F86=\"9 Mond\",\"2 Die Hohepriesterin\",IF(F86=\"Uranus\",\"0 Der Narr\",IF(F86=\"Neptun\",\"12 Der Gehängte\",IF(F86=\"Pluto\",\"20 Das Gericht\",IF(F86=0,0)))))))))))","v":0},{"$f":"IF(F86<>0,$C$13,0)","v":0},0,{"$f":"IF(H86=\"3 Zwillinge\",\"Herrscher\",IF(H86=\"6 Jungfrau\",\"Herrscher u. Erhöhung\",IF(H86=\"12 Fische\",\"Fall u. Exil\",IF(H86=\"9 Schütze\",\"Exil\",0))))","v":0},0,{"$f":"IF(OR(H86=\"1 Widder\",H86=\"4 Krebs\",H86=\"7 Waage\",H86=\"10 Steinbock\"),\"Kardinal\",IF(OR(H86=\"2 Stier\",H86=\"5 Löwe\",H86=\"8 Skorpion\",H86=\"11 Wassermann\"),\"Fix\",IF(OR(H86=\"3 Zwillinge\",H86=\"6 Jungfrau\",H86=\"9 Schütze\",H86=\"12 Fische\"),\"Veränderlich\",0)))","v":0},{"$f":"IF(AND(L86=\"Kardinal\",K86=\"1. Dekanat\"),2,IF(AND(L86=\"Kardinal\",K86=\"2. Dekanat\"),3,IF(AND(L86=\"Kardinal\",K86=\"3. Dekanat\"),4,IF(AND(L86=\"Fix\",K86=\"1. Dekanat\"),5,IF(AND(L86=\"Fix\",K86=\"2. Dekanat\"),6,IF(AND(L86=\"Fix\",K86=\"3. Dekanat\"),7,IF(AND(L86=\"Veränderlich\",K86=\"1. Dekanat\"),8,IF(AND(L86=\"Veränderlich\",K86=\"2. Dekanat\"),9,IF(AND(L86=\"Veränderlich\",K86=\"3. Dekanat\"),10,0)))))))))","v":0},0]
["Menschen und der Öffentlichkeit. Offene Feindschaften.",null,null,null,null,{"$f":"IF($B$14=\"7. Haus\",\"9 Mond\",0)","v":0},0,{"$f":"IF(F87<>0,$C$14,0)","v":0},0,{"$f":"IF(H87=\"4 Krebs\",\"Herrscher\",IF(H87=\"2 Stier\",\"Erhöhung\",IF(H87=\"8 Skorpion\",\"Fall\",IF(H87=\"10 Steinbock\",\"Exil\",0))))","v":0},0,0,0,0]
[" Das, was uns fehlt und wir in anderen suchen. Die Grosseltern ",null,null,null,null,{"$f":"IF($B$15=\"7. Haus\",\"Uranus\",0)","v":0},0,{"$f":"IF(F88<>0,$C$15,0)","v":0},0,{"$f":"IF(H88=\"11 Wassermann\",\"Herrscher\",IF(H88=\"5 Löwe\",\"Exil\",0))","v":0},0,0,0,0]
["und alle Menschen, die in unserem Auftrag handeln, z.B. ein",null,null,null,null,{"$f":"IF($B$16=\"7. Haus\",\"Neptun\",0)","v":"Neptun"},"12 Der Gehängte",{"$f":"IF(F89<>0,$C$16,0)","v":"10 Steinbock"},"15 Der Teufel",{"$f":"IF(H89=\"12 Fische\",\"Herrscher\",IF(H89=\"6 Jungfrau\",\"Exil\",0))","v":0},"2. Dekanat","Kardinal",3,"Münzen"]
[" Anwalt. ",null,null,null,null,{"$f":"IF($B$17=\"7. Haus\",\"Pluto\",0)","v":0},0,{"$f":"IF(F90<>0,$C$17,0)","v":0},0,{"$f":"IF(H90=\"8 Skorpion\",\"Herrscher\",IF(H90=\"2 Stier\",\"Exil\",0))","v":0},0,0,{"$f":"IF(AND(L90=\"Kardinal\",K90=\"1. Dekanat\"),2,IF(AND(L90=\"Kardinal\",K90=\"2. Dekanat\"),3,IF(AND(L90=\"Kardinal\",K90=\"3. Dekanat\"),4,IF(AND(L90=\"Fix\",K90=\"1. Dekanat\"),5,IF(AND(L90=\"Fix\",K90=\"2. Dekanat\"),6,IF(AND(L90=\"Fix\",K90=\"3. Dekanat\"),7,IF(AND(L90=\"Veränderlich\",K90=\"1. Dekanat\"),8,IF(AND(L90=\"Veränderlich\",K90=\"2. Dekanat\"),9,IF(AND(L90=\"Veränderlich\",K90=\"3. Dekanat\"),10,0)))))))))","v":0},0]
["8. Haus: e Materielle Verluste, gemeinschaftliches Gut",{"$f":"H9","v":"10 Steinbock"},{"$f":"IF(B91=\"1 Widder\",\"4 Der Herrscher\",IF(B91=\"2 Stier\",\"5 Der Hierophant\",IF(B91=\"3 Zwillinge\",\"6 Die Liebenden\",IF(B91=\"4 Krebs\",\"7 Der Wagen\",IF(B91=\"5 Löwe\",\"8 Die Kraft\",IF(B91=\"6 Jungfrau\",\"9 Der Eremit\",IF(B91=\"7 Waage\",\"11 Die Gerechtigkeit\",IF(B91=\"8 Skorpion\",\"13 Der Tod\",IF(B91=\"9 Schütze\",\"14 Die Mässigkeit\",IF(B91=\"10 Steinbock\",\"15 Der Teufel\",IF(B91=\"11 Wassermann\",\"17 Der Stern\",IF(B91=\"12 Fische\",\"18 Der Mond\"))))))))))))","v":"15 Der Teufel"},{"$f":"IF(B91=\"1 Widder\",\"5 Mars\",IF(B91=\"2 Stier\",\"7 Venus\",IF(B91=\"3 Zwillinge\",\"8 Merkur\",IF(B91=\"4 Krebs\",\"9 Mond\",IF(B91=\"5 Löwe\",\"6 Sonne\",IF(B91=\"6 Jungfrau\",\"8 Merkur\",IF(B91=\"7 Waage\",\"7 Venus\",IF(B91=\"8 Skorpion\",\"5 Mars\",IF(B91=\"9 Schütze\",\"4 Jupiter\",IF(B91=\"10 Steinbock\",\"3 Saturn\",IF(B91=\"11 Wassermann\",\"3 Saturn\",IF(B91=\"12 Fische\",\"4 Jupiter\"))))))))))))","v":"3 Saturn"},{"$f":"IF(D91=\"3 Saturn\",\"21 Die Welt\",IF(D91=\"4 Jupiter\",\"10 Das Rad\",IF(D91=\"5 Mars\",\"16 Der Turm\",IF(D91=\"6 Sonne\",\"19 Die Sonne\",IF(D91=\"7 Venus\",\"3 Die Herrscherin\",IF(D91=\"8 Merkur\",\"1 Der Magier\",IF(D91=\"9 Mond\",\"2 Die Hohepriesterin\",IF(D91=0,0))))))))","v":"21 Die Welt"},{"$f":"IF($B$8=\"8. Haus\",\"3 Saturn\",0)","v":0},0,{"$f":"IF(F91<>0,$C$8,0)","v":0},0,{"$f":"IF(OR(H91=\"10 Steinbock\",H91=\"11 Wassermann\"),\"Herrscher\",IF(H91=\"7 Waage\",\"Erhöhung\",IF(H91=\"1 Widder\",\"Fall\",IF(OR(H91=\"4 Krebs\",H91=\"5 Löwe\"),\"Exil\",0))))","v":0},{"$f":"IF(G91<>0,D8,0)","v":0},0,{"$f":"IF(AND(L91=\"Kardinal\",K91=\"1. Dekanat\"),2,IF(AND(L91=\"Kardinal\",K91=\"2. Dekanat\"),3,IF(AND(L91=\"Kardinal\",K91=\"3. Dekanat\"),4,IF(AND(L91=\"Fix\",K91=\"1. Dekanat\"),5,IF(AND(L91=\"Fix\",K91=\"2. Dekanat\"),6,IF(AND(L91=\"Fix\",K91=\"3. Dekanat\"),7,IF(AND(L91=\"Veränderlich\",K91=\"1. Dekanat\"),8,IF(AND(L91=\"Veränderlich\",K91=\"2. Dekanat\"),9,IF(AND(L91=\"Veränderlich\",K91=\"3. Dekanat\"),10,0)))))))))","v":0},{"$f":"IF(OR(H91=\"1 Widder\",H91=\"5 Löwe\",H91=\"9 Schütze\"),\"Stäbe\",IF(OR(H91=\"2 Stier\",H91=\"6 Jungfrau\",H91=\"10 Steinbock\"),\"Münzen\",IF(OR(H91=\"3 Zwillinge\",H91=\"7 Waage\",H91=\"11 Wassermann\"),\"Schwerter\",IF(OR(H91=\"4 Krebs\",H91=\"8 Skorpion\",H91=\"12 Fische\"),\"Kelche\",0))))","v":0}]
["Ich ergründe. ",null,null,{"$f":"IF(B91=\"8 Skorpion\",\"Pluto\",IF(B91=\"11 Wassermann\",\"Uranus\",IF(B91=\"12 Fische\",\"Neptun\",0)))","v":0},{"$f":"IF(D92=\"Pluto\",\"20 Das Gericht\",IF(D92=\"Uranus\",\"0 Der Narr\",IF(D92=\"Neptun\",\"12 Der Gehängte\",0)))","v":0},{"$f":"IF($B$9=\"8. Haus\",\"4 Jupiter\",0)","v":0},0,{"$f":"IF(F92<>0,$C$9,0)","v":0},0,{"$f":"IF(OR(H92=\"9 Schütze\",H92=\"12 Fische\"),\"Herrscher\",IF(H92=\"4 Krebs\",\"Erhöhung\",IF(H92=\"10 Steinbock\",\"Fall\",IF(OR(H92=\"3 Zwillinge\",H92=\"6 Jungfrau\"),\"Exil\",0))))","v":0},{"$f":"IF(G92<>0,D9,0)","v":0},0,0,0]
["Archaische Urkräfte, Sexualität, Tod, Wandlung, ",null,null,null,null,{"$f":"IF($B$10=\"8. Haus\",\"5 Mars\",0)","v":0},0,{"$f":"IF(F93<>0,$C$10,0)","v":0},0,{"$f":"IF(OR(H93=\"1 Widder\",H93=\"8 Skorpion\"),\"Herrscher\",IF(H93=\"10 Steinbock\",\"Erhöhung\",IF(H93=\"4 Krebs\",\"Fall\",IF(OR(H93=\"2 Stier\",H93=\"7 Waage\"),\"Exil\",0))))","v":0},0,0,0,0]
["Transformation, übersinnliche Erfahrungen, Loslassen, Tabus. ",null,null,null,null,{"$f":"IF($B$11=\"8. Haus\",\"6 Sonne\",0)","v":0},0,{"$f":"IF(F94<>0,$C$11,0)","v":0},0,{"$f":"IF(H94=\"5 Löwe\",\"Herrscher\",0)","v":0},0,0,0,0]
["Das Geld von anderen, Geld von Geschäfts- oder ",null,null,null,null,{"$f":"IF($B$12=\"8. Haus\",\"7 Venus\",0)","v":0},0,{"$f":"IF(F95<>0,$C$12,0)","v":0},0,{"$f":"IF(OR(H95=\"2 Stier\",H95=\"7 Waage\"),\"Herrscher\",IF(H95=\"12 Fische\",\"Erhöhung\",IF(H95=\"6 Jungfrau\",\"Fall\",IF(OR(H95=\"8 Skorpion\",H95=\"1 Widder\"),\"Exil\",0))))","v":0},0,0,0,0]
["Lebenspartnern, Erbschaften, Steuern, Versicherungen. ",null,null,null,null,{"$f":"IF($B$13=\"7. Haus\",\"8 Merkur\",0)","v":0},0,{"$f":"IF(F96<>0,$C$13,0)","v":0},0,{"$f":"IF(H96=\"3 Zwillinge\",\"Herrscher\",IF(H96=\"6 Jungfrau\",\"Herrscher u. Erhöhung\",IF(H96=\"12 Fische\",\"Fall u. Exil\",IF(H96=\"9 Schütze\",\"Exil\",0))))","v":0},0,0,0,0]
["Esoterik, Okkultes, Geheimnisse, übernatürliche Kräfte, ",null,null,null,null,{"$f":"IF($B$14=\"8. Haus\",\"9 Mond\",0)","v":0},0,{"$f":"IF(F97<>0,$C$14,0)","v":0},0,{"$f":"IF(H97=\"4 Krebs\",\"Herrscher\",IF(H97=\"2 Stier\",\"Erhöhung\",IF(H97=\"8 Skorpion\",\"Fall\",IF(H97=\"10 Steinbock\",\"Exil\",0))))","v":0},0,0,0,0]
["Magie, Schamanismus, Hexen. Die Unterstützung durch ",null,null,null,null,{"$f":"IF($B$15=\"8. Haus\",\"Uranus\",0)","v":0},0,{"$f":"IF(F98<>0,$C$15,0)","v":0},0,{"$f":"IF(H98=\"11 Wassermann\",\"Herrscher\",IF(H98=\"5 Löwe\",\"Exil\",0))","v":0},0,0,0,0]
["andere Personen auf allen Ebenen. Das Suchen in der Tiefe, ",null,null,null,null,{"$f":"IF($B$16=\"8. Haus\",\"Neptun\",0)","v":0},0,{"$f":"IF(F99<>0,$C$16,0)","v":0},0,{"$f":"IF(H99=\"12 Fische\",\"Herrscher\",IF(H99=\"6 Jungfrau\",\"Exil\",0))","v":0},0,0,0,0]
["Forschung. Operationen.",null,null,null,null,{"$f":"IF($B$17=\"8. Haus\",\"Pluto\",0)","v":0},0,{"$f":"IF(F100<>0,$C$17,0)","v":0},0,{"$f":"IF(H100=\"8 Skorpion\",\"Herrscher\",IF(H100=\"2 Stier\",\"Exil\",0))","v":0},0,0,0,0]
["9. Haus: f Weltanschauung und ferne Länder",{"$f":"H10","v":"11 Wassermann"},{"$f":"IF(B101=\"1 Widder\",\"4 Der Herrscher\",IF(B101=\"2 Stier\",\"5 Der Hierophant\",IF(B101=\"3 Zwillinge\",\"6 Die Liebenden\",IF(B101=\"4 Krebs\",\"7 Der Wagen\",IF(B101=\"5 Löwe\",\"8 Die Kraft\",IF(B101=\"6 Jungfrau\",\"9 Der Eremit\",IF(B101=\"7 Waage\",\"11 Die Gerechtigkeit\",IF(B101=\"8 Skorpion\",\"13 Der Tod\",IF(B101=\"9 Schütze\",\"14 Die Mässigkeit\",IF(B101=\"10 Steinbock\",\"15 Der Teufel\",IF(B101=\"11 Wassermann\",\"17 Der Stern\",IF(B101=\"12 Fische\",\"18 Der Mond\"))))))))))))","v":"17 Der Stern"},{"$f":"IF(B101=\"1 Widder\",\"5 Mars\",IF(B101=\"2 Stier\",\"7 Venus\",IF(B101=\"3 Zwillinge\",\"8 Merkur\",IF(B101=\"4 Krebs\",\"9 Mond\",IF(B101=\"5 Löwe\",\"6 Sonne\",IF(B101=\"6 Jungfrau\",\"8 Merkur\",IF(B101=\"7 Waage\",\"7 Venus\",IF(B101=\"8 Skorpion\",\"5 Mars\",IF(B101=\"9 Schütze\",\"4 Jupiter\",IF(B101=\"10 Steinbock\",\"3 Saturn\",IF(B101=\"11 Wassermann\",\"3 Saturn\",IF(B101=\"12 Fische\",\"4 Jupiter\"))))))))))))","v":"3 Saturn"},{"$f":"IF(D101=\"3 Saturn\",\"21 Die Welt\",IF(D101=\"4 Jupiter\",\"10 Das Rad\",IF(D101=\"5 Mars\",\"16 Der Turm\",IF(D101=\"6 Sonne\",\"19 Die Sonne\",IF(D101=\"7 Venus\",\"3 Die Herrscherin\",IF(D101=\"8 Merkur\",\"1 Der Magier\",IF(D101=\"9 Mond\",\"2 Die Hohepriesterin\",IF(D101=0,0))))))))","v":"21 Die Welt"},{"$f":"IF($B$8=\"9. Haus\",\"3 Saturn\",0)","v":0},0,{"$f":"IF(F101<>0,$C$8,0)","v":0},0,{"$f":"IF(OR(H101=\"10 Steinbock\",H101=\"11 Wassermann\"),\"Herrscher\",IF(H101=\"7 Waage\",\"Erhöhung\",IF(H101=\"1 Widder\",\"Fall\",IF(OR(H101=\"4 Krebs\",H101=\"5 Löwe\"),\"Exil\",0))))","v":0},{"$f":"IF(G101<>0,D8,0)","v":0},0,0,{"$f":"IF(OR(H101=\"1 Widder\",H101=\"5 Löwe\",H101=\"9 Schütze\"),\"Stäbe\",IF(OR(H101=\"2 Stier\",H101=\"6 Jungfrau\",H101=\"10 Steinbock\"),\"Münzen\",IF(OR(H101=\"3 Zwillinge\",H101=\"7 Waage\",H101=\"11 Wassermann\"),\"Schwerter\",IF(OR(H101=\"4 Krebs\",H101=\"8 Skorpion\",H101=\"12 Fische\"),\"Kelche\",0))))","v":0}]
["Ich glaube. ",null,null,{"$f":"IF(B101=\"8 Skorpion\",\"Pluto\",IF(B101=\"11 Wassermann\",\"Uranus\",IF(B101=\"12 Fische\",\"Neptun\",0)))","v":"Uranus"},{"$f":"IF(D102=\"Pluto\",\"20 Das Gericht\",IF(D102=\"Uranus\",\"0 Der Narr\",IF(D102=\"Neptun\",\"12 Der Gehängte\",0)))","v":"0 Der Narr"},{"$f":"IF($B$9=\"9. Haus\",\"4 Jupiter\",0)","v":0},0,{"$f":"IF(F102<>0,$C$9,0)","v":0},0,{"$f":"IF(OR(H102=\"9 Schütze\",H102=\"12 Fische\"),\"Herrscher\",IF(H102=\"4 Krebs\",\"Erhöhung\",IF(H102=\"10 Steinbock\",\"Fall\",IF(OR(H102=\"3 Zwillinge\",H102=\"6 Jungfrau\"),\"Exil\",0))))","v":0},{"$f":"IF(G102<>0,D9,0)","v":0},0,0,0]
["Die persönliche Suche nach dem Sinn des Lebens, Philosophie, ",null,null,null,null,{"$f":"IF($B$10=\"9. Haus\",\"5 Mars\",0)","v":0},0,{"$f":"IF(F103<>0,$C$10,0)","v":0},0,{"$f":"IF(OR(H103=\"1 Widder\",H103=\"8 Skorpion\"),\"Herrscher\",IF(H103=\"10 Steinbock\",\"Erhöhung\",IF(H103=\"4 Krebs\",\"Fall\",IF(OR(H103=\"2 Stier\",H103=\"7 Waage\"),\"Exil\",0))))","v":0},0,{"$f":"IF(OR(H103=\"1 Widder\",H103=\"4 Krebs\",H103=\"7 Waage\",H103=\"10 Steinbock\"),\"Kardinal\",IF(OR(H103=\"2 Stier\",H103=\"5 Löwe\",H103=\"8 Skorpion\",H103=\"11 Wassermann\"),\"Fix\",IF(OR(H103=\"3 Zwillinge\",H103=\"6 Jungfrau\",H103=\"9 Schütze\",H103=\"12 Fische\"),\"Veränderlich\",0)))","v":0},0,0]
["Ausbildung, Erziehung, Religion, Psychologie, Träume, ",null,null,null,null,{"$f":"IF($B$11=\"9. Haus\",\"6 Sonne\",0)","v":0},0,{"$f":"IF(F104<>0,$C$11,0)","v":0},0,{"$f":"IF(H104=\"5 Löwe\",\"Herrscher\",0)","v":0},0,{"$f":"IF(OR(H104=\"1 Widder\",H104=\"4 Krebs\",H104=\"7 Waage\",H104=\"10 Steinbock\"),\"Kardinal\",IF(OR(H104=\"2 Stier\",H104=\"5 Löwe\",H104=\"8 Skorpion\",H104=\"11 Wassermann\"),\"Fix\",IF(OR(H104=\"3 Zwillinge\",H104=\"6 Jungfrau\",H104=\"9 Schütze\",H104=\"12 Fische\"),\"Veränderlich\",0)))","v":0},0,0]
["Visionen, Ideale, Ethik, Überzeugungen, Weltbild. Lange ",null,null,null,null,{"$f":"IF($B$12=\"9. Haus\",\"7 Venus\",0)","v":0},0,{"$f":"IF(F105<>0,$C$12,0)","v":0},0,{"$f":"IF(OR(H105=\"2 Stier\",H105=\"7 Waage\"),\"Herrscher\",IF(H105=\"12 Fische\",\"Erhöhung\",IF(H105=\"6 Jungfrau\",\"Fall\",IF(OR(H105=\"8 Skorpion\",H105=\"1 Widder\"),\"Exil\",0))))","v":0},0,0,0,0]
["Reisen, ferne Länder, Urlaub, Veröffentlichungen, Lehrtätigkeit. ",null,null,null,null,{"$f":"IF($B$13=\"9. Haus\",\"8 Merkur\",0)","v":0},0,{"$f":"IF(F106<>0,$C$13,0)","v":0},0,{"$f":"IF(H106=\"3 Zwillinge\",\"Herrscher\",IF(H106=\"6 Jungfrau\",\"Herrscher u. Erhöhung\",IF(H106=\"12 Fische\",\"Fall u. Exil\",IF(H106=\"9 Schütze\",\"Exil\",0))))","v":0},0,0,0,0]
["Wertvorstellungen, Gerechtigkeitsempfinden, Denkweise, ",null,null,null,null,{"$f":"IF($B$14=\"9. Haus\",\"9 Mond\",0)","v":0},0,{"$f":"IF(F107<>0,$C$14,0)","v":0},0,{"$f":"IF(H107=\"4 Krebs\",\"Herrscher\",IF(H107=\"2 Stier\",\"Erhöhung\",IF(H107=\"8 Skorpion\",\"Fall\",IF(H107=\"10 Steinbock\",\"Exil\",0))))","v":0},0,0,0,0]
["Denkmuster, das höhere Bewusstsein. Handel mit fernen ",null,null,null,null,{"$f":"IF($B$15=\"9. Haus\",\"Uranus\",0)","v":0},0,{"$f":"IF(F108<>0,$C$15,0)","v":0},0,{"$f":"IF(H108=\"11 Wassermann\",\"Herrscher\",IF(H108=\"5 Löwe\",\"Exil\",0))","v":0},0,0,0,0]
["Ländern, Grossindustrie, Importe, Exporte. Die Kirche, der Klerus,",null,null,null,null,{"$f":"IF($B$16=\"9. Haus\",\"Neptun\",0)","v":0},0,{"$f":"IF(F109<>0,$C$16,0)","v":0},0,{"$f":"IF(H109=\"12 Fische\",\"Herrscher\",IF(H109=\"6 Jungfrau\",\"Exil\",0))","v":0},0,0,0,{"$f":"IF(OR(H109=\"1 Widder\",H109=\"5 Löwe\",H109=\"9 Schütze\"),\"Stäbe\",IF(OR(H109=\"2 Stier\",H109=\"6 Jungfrau\",H109=\"10 Steinbock\"),\"Münzen\",IF(OR(H109=\"3 Zwillinge\",H109=\"7 Waage\",H109=\"11 Wassermann\"),\"Schwerter\",IF(OR(H109=\"4 Krebs\",H109=\"8 Skorpion\",H109=\"12 Fische\"),\"Kelche\",0))))","v":0}]
[" die angeheiratete Verwandtschaft, Enkel. ",null,null,null,null,{"$f":"IF($B$17=\"9. Haus\",\"Pluto\",0)","v":0},0,{"$f":"IF(F110<>0,$C$17,0)","v":0},0,{"$f":"IF(H110=\"8 Skorpion\",\"Herrscher\",IF(H110=\"2 Stier\",\"Exil\",0))","v":0},0,0,0,0]
["10. Haus: ♑ Beruf und Berufung (Medium Coeli)",{"$f":"H11","v":"12 Fische"},{"$f":"IF(B111=\"1 Widder\",\"4 Der Herrscher\",IF(B111=\"2 Stier\",\"5 Der Hierophant\",IF(B111=\"3 Zwillinge\",\"6 Die Liebenden\",IF(B111=\"4 Krebs\",\"7 Der Wagen\",IF(B111=\"5 Löwe\",\"8 Die Kraft\",IF(B111=\"6 Jungfrau\",\"9 Der Eremit\",IF(B111=\"7 Waage\",\"11 Die Gerechtigkeit\",IF(B111=\"8 Skorpion\",\"13 Der Tod\",IF(B111=\"9 Schütze\",\"14 Die Mässigkeit\",IF(B111=\"10 Steinbock\",\"15 Der Teufel\",IF(B111=\"11 Wassermann\",\"17 Der Stern\",IF(B111=\"12 Fische\",\"18 Der Mond\"))))))))))))","v":"18 Der Mond"},{"$f":"IF(B111=\"1 Widder\",\"5 Mars\",IF(B111=\"2 Stier\",\"7 Venus\",IF(B111=\"3 Zwillinge\",\"8 Merkur\",IF(B111=\"4 Krebs\",\"9 Mond\",IF(B111=\"5 Löwe\",\"6 Sonne\",IF(B111=\"6 Jungfrau\",\"8 Merkur\",IF(B111=\"7 Waage\",\"7 Venus\",IF(B111=\"8 Skorpion\",\"5 Mars\",IF(B111=\"9 Schütze\",\"4 Jupiter\",IF(B111=\"10 Steinbock\",\"3 Saturn\",IF(B111=\"11 Wassermann\",\"3 Saturn\",IF(B111=\"12 Fische\",\"4 Jupiter\"))))))))))))","v":"4 Jupiter"},{"$f":"IF(D111=\"3 Saturn\",\"21 Die Welt\",IF(D111=\"4 Jupiter\",\"10 Das Rad\",IF(D111=\"5 Mars\",\"16 Der Turm\",IF(D111=\"6 Sonne\",\"19 Die Sonne\",IF(D111=\"7 Venus\",\"3 Die Herrscherin\",IF(D111=\"8 Merkur\",\"1 Der Magier\",IF(D111=\"9 Mond\",\"2 Die Hohepriesterin\",IF(D111=0,0))))))))","v":"10 Das Rad"},{"$f":"IF($B$8=\"10. Haus\",\"3 Saturn\",0)","v":0},0,{"$f":"IF(F111<>0,$C$8,0)","v":0},0,{"$f":"IF(OR(H111=\"10 Steinbock\",H111=\"11 Wassermann\"),\"Herrscher\",IF(H111=\"7 Waage\",\"Erhöhung\",IF(H111=\"1 Widder\",\"Fall\",IF(OR(H111=\"4 Krebs\",H111=\"5 Löwe\"),\"Exil\",0))))","v":0},{"$f":"IF(G111<>0,D8,0)","v":0},0,0,{"$f":"IF(OR(H111=\"1 Widder\",H111=\"5 Löwe\",H111=\"9 Schütze\"),\"Stäbe\",IF(OR(H111=\"2 Stier\",H111=\"6 Jungfrau\",H111=\"10 Steinbock\"),\"Münzen\",IF(OR(H111=\"3 Zwillinge\",H111=\"7 Waage\",H111=\"11 Wassermann\"),\"Schwerter\",IF(OR(H111=\"4 Krebs\",H111=\"8 Skorpion\",H111=\"12 Fische\"),\"Kelche\",0))))","v":0}]
["Ich erstrebe. ",null,null,{"$f":"IF(B111=\"8 Skorpion\",\"Pluto\",IF(B111=\"11 Wassermann\",\"Uranus\",IF(B111=\"12 Fische\",\"Neptun\",0)))","v":"Neptun"},{"$f":"IF(D112=\"Pluto\",\"20 Das Gericht\",IF(D112=\"Uranus\",\"0 Der Narr\",IF(D112=\"Neptun\",\"12 Der Gehängte\",0)))","v":"12 Der Gehängte"},{"$f":"IF($B$9=\"10. Haus\",\"4 Jupiter\",0)","v":0},0,{"$f":"IF(F112<>0,$C$9,0)","v":0},0,{"$f":"IF(OR(H112=\"9 Schütze\",H112=\"12 Fische\"),\"Herrscher\",IF(H112=\"4 Krebs\",\"Erhöhung\",IF(H112=\"10 Steinbock\",\"Fall\",IF(OR(H112=\"3 Zwillinge\",H112=\"6 Jungfrau\"),\"Exil\",0))))","v":0},{"$f":"IF(G112<>0,D9,0)","v":0},0,0,0]
["Ehre, Status, Ruhm, Prestige, Ego, Anerkennung. Berufliche ",null,null,null,null,{"$f":"IF($B$10=\"10. Haus\",\"5 Mars\",0)","v":0},0,{"$f":"IF(F113<>0,$C$10,0)","v":0},0,{"$f":"IF(OR(H113=\"1 Widder\",H113=\"8 Skorpion\"),\"Herrscher\",IF(H113=\"10 Steinbock\",\"Erhöhung\",IF(H113=\"4 Krebs\",\"Fall\",IF(OR(H113=\"2 Stier\",H113=\"7 Waage\"),\"Exil\",0))))","v":0},0,0,0,0]
["Karriere, beruflicher Erfolg, Ambitionen. Arbeitgeber, behördliche ",null,null,null,null,{"$f":"IF($B$11=\"10. Haus\",\"6 Sonne\",0)","v":0},0,{"$f":"IF(F114<>0,$C$11,0)","v":0},0,{"$f":"IF(H114=\"5 Löwe\",\"Herrscher\",0)","v":0},0,0,0,0]
["Angelegenheiten. Verwirklichung der Lebensziele. Entfaltung der ",null,null,null,null,{"$f":"IF($B$12=\"10. Haus\",\"7 Venus\",0)","v":0},0,{"$f":"IF(F115<>0,$C$12,0)","v":0},0,{"$f":"IF(OR(H115=\"2 Stier\",H115=\"7 Waage\"),\"Herrscher\",IF(H115=\"12 Fische\",\"Erhöhung\",IF(H115=\"6 Jungfrau\",\"Fall\",IF(OR(H115=\"8 Skorpion\",H115=\"1 Widder\"),\"Exil\",0))))","v":0},0,0,0,0]
["Talente, Berufung. Der Elternteil, zu dem man eine distanziertere",null,null,null,null,{"$f":"IF($B$13=\"10. Haus\",\"8 Merkur\",0)","v":0},0,{"$f":"IF(F116<>0,$C$13,0)","v":0},0,{"$f":"IF(H116=\"3 Zwillinge\",\"Herrscher\",IF(H116=\"6 Jungfrau\",\"Herrscher u. Erhöhung\",IF(H116=\"12 Fische\",\"Fall u. Exil\",IF(H116=\"9 Schütze\",\"Exil\",0))))","v":0},0,0,0,0]
[" Beziehung hat, der autoritärere Elternteil. Alle ",null,null,null,null,{"$f":"IF($B$14=\"10. Haus\",\"9 Mond\",0)","v":0},0,{"$f":"IF(F117<>0,$C$14,0)","v":0},0,{"$f":"IF(H117=\"4 Krebs\",\"Herrscher\",IF(H117=\"2 Stier\",\"Erhöhung\",IF(H117=\"8 Skorpion\",\"Fall\",IF(H117=\"10 Steinbock\",\"Exil\",0))))","v":0},0,0,0,0]
["Autoritätspersonen und Institutionen, die Macht über uns haben.",null,null,null,null,{"$f":"IF($B$15=\"10. Haus\",\"Uranus\",0)","v":0},0,{"$f":"IF(F118<>0,$C$15,0)","v":0},0,{"$f":"IF(H118=\"11 Wassermann\",\"Herrscher\",IF(H118=\"5 Löwe\",\"Exil\",0))","v":0},0,0,0,0]
[null,null,null,null,null,{"$f":"IF($B$16=\"10. Haus\",\"Neptun\",0)","v":0},0,{"$f":"IF(F119<>0,$C$16,0)","v":0},0,{"$f":"IF(H119=\"12 Fische\",\"Herrscher\",IF(H119=\"6 Jungfrau\",\"Exil\",0))","v":0},0,0,0,0]
[null,null,null,null,null,{"$f":"IF($B$17=\"10. Haus\",\"Pluto\",0)","v":0},0,{"$f":"IF(F120<>0,$C$17,0)","v":0},0,{"$f":"IF(H120=\"8 Skorpion\",\"Herrscher\",IF(H120=\"2 Stier\",\"Exil\",0))","v":0},0,0,{"$f":"IF(AND(L120=\"Kardinal\",K120=\"1. Dekanat\"),2,IF(AND(L120=\"Kardinal\",K120=\"2. Dekanat\"),3,IF(AND(L120=\"Kardinal\",K120=\"3. Dekanat\"),4,IF(AND(L120=\"Fix\",K120=\"1. Dekanat\"),5,IF(AND(L120=\"Fix\",K120=\"2. Dekanat\"),6,IF(AND(L120=\"Fix\",K120=\"3. Dekanat\"),7,IF(AND(L120=\"Veränderlich\",K120=\"1. Dekanat\"),8,IF(AND(L120=\"Veränderlich\",K120=\"2. Dekanat\"),9,IF(AND(L120=\"Veränderlich\",K120=\"3. Dekanat\"),10,0)))))))))","v":0},0]
["11. Haus: h Freunde und Gesellschaft",{"$f":"H12","v":"1 Widder"},{"$f":"IF(B121=\"1 Widder\",\"4 Der Herrscher\",IF(B121=\"2 Stier\",\"5 Der Hierophant\",IF(B121=\"3 Zwillinge\",\"6 Die Liebenden\",IF(B121=\"4 Krebs\",\"7 Der Wagen\",IF(B121=\"5 Löwe\",\"8 Die Kraft\",IF(B121=\"6 Jungfrau\",\"9 Der Eremit\",IF(B121=\"7 Waage\",\"11 Die Gerechtigkeit\",IF(B121=\"8 Skorpion\",\"13 Der Tod\",IF(B121=\"9 Schütze\",\"14 Die Mässigkeit\",IF(B121=\"10 Steinbock\",\"15 Der Teufel\",IF(B121=\"11 Wassermann\",\"17 Der Stern\",IF(B121=\"12 Fische\",\"18 Der Mond\"))))))))))))","v":"4 Der Herrscher"},{"$f":"IF(B121=\"1 Widder\",\"5 Mars\",IF(B121=\"2 Stier\",\"7 Venus\",IF(B121=\"3 Zwillinge\",\"8 Merkur\",IF(B121=\"4 Krebs\",\"9 Mond\",IF(B121=\"5 Löwe\",\"6 Sonne\",IF(B121=\"6 Jungfrau\",\"8 Merkur\",IF(B121=\"7 Waage\",\"7 Venus\",IF(B121=\"8 Skorpion\",\"5 Mars\",IF(B121=\"9 Schütze\",\"4 Jupiter\",IF(B121=\"10 Steinbock\",\"3 Saturn\",IF(B121=\"11 Wassermann\",\"3 Saturn\",IF(B121=\"12 Fische\",\"4 Jupiter\"))))))))))))","v":"5 Mars"},{"$f":"IF(D121=\"3 Saturn\",\"21 Die Welt\",IF(D121=\"4 Jupiter\",\"10 Das Rad\",IF(D121=\"5 Mars\",\"16 Der Turm\",IF(D121=\"6 Sonne\",\"19 Die Sonne\",IF(D121=\"7 Venus\",\"3 Die Herrscherin\",IF(D121=\"8 Merkur\",\"1 Der Magier\",IF(D121=\"9 Mond\",\"2 Die Hohepriesterin\",IF(D121=0,0))))))))","v":"16 Der Turm"},{"$f":"IF($B$8=\"11. Haus\",\"3 Saturn\",0)","v":0},0,{"$f":"IF(F121<>0,$C$8,0)","v":0},0,{"$f":"IF(OR(H121=\"10 Steinbock\",H121=\"11 Wassermann\"),\"Herrscher\",IF(H121=\"7 Waage\",\"Erhöhung\",IF(H121=\"1 Widder\",\"Fall\",IF(OR(H121=\"4 Krebs\",H121=\"5 Löwe\"),\"Exil\",0))))","v":0},{"$f":"IF(G121<>0,D8,0)","v":0},0,{"$f":"IF(AND(L121=\"Kardinal\",K121=\"1. Dekanat\"),2,IF(AND(L121=\"Kardinal\",K121=\"2. Dekanat\"),3,IF(AND(L121=\"Kardinal\",K121=\"3. Dekanat\"),4,IF(AND(L121=\"Fix\",K121=\"1. Dekanat\"),5,IF(AND(L121=\"Fix\",K121=\"2. Dekanat\"),6,IF(AND(L121=\"Fix\",K121=\"3. Dekanat\"),7,IF(AND(L121=\"Veränderlich\",K121=\"1. Dekanat\"),8,IF(AND(L121=\"Veränderlich\",K121=\"2. Dekanat\"),9,IF(AND(L121=\"Veränderlich\",K121=\"3. Dekanat\"),10,0)))))))))","v":0},{"$f":"IF(OR(H121=\"1 Widder\",H121=\"5 Löwe\",H121=\"9 Schütze\"),\"Stäbe\",IF(OR(H121=\"2 Stier\",H121=\"6 Jungfrau\",H121=\"10 Steinbock\"),\"Münzen\",IF(OR(H121=\"3 Zwillinge\",H121=\"7 Waage\",H121=\"11 Wassermann\"),\"Schwerter\",IF(OR(H121=\"4 Krebs\",H121=\"8 Skorpion\",H121=\"12 Fische\"),\"Kelche\",0))))","v":0}]
["Meine Freunde.",null,null,{"$f":"IF(B121=\"8 Skorpion\",\"Pluto\",IF(B121=\"11 Wassermann\",\"Uranus\",IF(B121=\"12 Fische\",\"Neptun\",0)))","v":0},{"$f":"IF(D122=\"Pluto\",\"20 Das Gericht\",IF(D122=\"Uranus\",\"0 Der Narr\",IF(D122=\"Neptun\",\"12 Der Gehängte\",0)))","v":0},{"$f":"IF($B$9=\"11. Haus\",\"4 Jupiter\",0)","v":0},0,{"$f":"IF(F122<>0,$C$9,0)","v":0},0,{"$f":"IF(OR(H122=\"9 Schütze\",H122=\"12 Fische\"),\"Herrscher\",IF(H122=\"4 Krebs\",\"Erhöhung\",IF(H122=\"10 Steinbock\",\"Fall\",IF(OR(H122=\"3 Zwillinge\",H122=\"6 Jungfrau\"),\"Exil\",0))))","v":0},{"$f":"IF(G122<>0,D9,0)","v":0},0,0,0]
["Ziele. Freunde, soziales Umfeld, Netzwerk, Gruppen, Vereine.",null,null,null,null,{"$f":"IF($B$10=\"11. Haus\",\"5 Mars\",0)","v":0},0,{"$f":"IF(F123<>0,$C$10,0)","v":0},0,{"$f":"IF(OR(H123=\"1 Widder\",H123=\"8 Skorpion\"),\"Herrscher\",IF(H123=\"10 Steinbock\",\"Erhöhung\",IF(H123=\"4 Krebs\",\"Fall\",IF(OR(H123=\"2 Stier\",H123=\"7 Waage\"),\"Exil\",0))))","v":0},0,0,0,0]
[" Veränderungen und Revolutionen. Humanität, Hoffnungen",null,null,null,null,{"$f":"IF($B$11=\"11. Haus\",\"6 Sonne\",0)","v":"6 Sonne"},"19 Die Sonne",{"$f":"IF(F124<>0,$C$11,0)","v":"2 Stier"},"5 Der Hierophant",{"$f":"IF(H124=\"5 Löwe\",\"Herrscher\",0)","v":0},"3. Dekanat","Fix",7,"Münzen"]
[" und Ängste, humanitäre Ideale, Erwartungen. Weltbürgertum.",null,null,null,null,{"$f":"IF($B$12=\"11. Haus\",\"7 Venus\",0)","v":0},0,{"$f":"IF(F125<>0,$C$12,0)","v":0},0,{"$f":"IF(OR(H125=\"2 Stier\",H125=\"7 Waage\"),\"Herrscher\",IF(H125=\"12 Fische\",\"Erhöhung\",IF(H125=\"6 Jungfrau\",\"Fall\",IF(OR(H125=\"8 Skorpion\",H125=\"1 Widder\"),\"Exil\",0))))","v":0},0,0,{"$f":"IF(AND(L125=\"Kardinal\",K125=\"1. Dekanat\"),2,IF(AND(L125=\"Kardinal\",K125=\"2. Dekanat\"),3,IF(AND(L125=\"Kardinal\",K125=\"3. Dekanat\"),4,IF(AND(L125=\"Fix\",K125=\"1. Dekanat\"),5,IF(AND(L125=\"Fix\",K125=\"2. Dekanat\"),6,IF(AND(L125=\"Fix\",K125=\"3. Dekanat\"),7,IF(AND(L125=\"Veränderlich\",K125=\"1. Dekanat\"),8,IF(AND(L125=\"Veränderlich\",K125=\"2. Dekanat\"),9,IF(AND(L125=\"Veränderlich\",K125=\"3. Dekanat\"),10,0)))))))))","v":0},0]
["Das, was man vom Leben erwartet, die Lebensziele. Die ",null,null,null,null,{"$f":"IF($B$13=\"11. Haus\",\"8 Merkur\",0)","v":0},0,{"$f":"IF(F126<>0,$C$13,0)","v":0},0,{"$f":"IF(H126=\"3 Zwillinge\",\"Herrscher\",IF(H126=\"6 Jungfrau\",\"Herrscher u. Erhöhung\",IF(H126=\"12 Fische\",\"Fall u. Exil\",IF(H126=\"9 Schütze\",\"Exil\",0))))","v":0},0,0,{"$f":"IF(AND(L126=\"Kardinal\",K126=\"1. Dekanat\"),2,IF(AND(L126=\"Kardinal\",K126=\"2. Dekanat\"),3,IF(AND(L126=\"Kardinal\",K126=\"3. Dekanat\"),4,IF(AND(L126=\"Fix\",K126=\"1. Dekanat\"),5,IF(AND(L126=\"Fix\",K126=\"2. Dekanat\"),6,IF(AND(L126=\"Fix\",K126=\"3. Dekanat\"),7,IF(AND(L126=\"Veränderlich\",K126=\"1. Dekanat\"),8,IF(AND(L126=\"Veränderlich\",K126=\"2. Dekanat\"),9,IF(AND(L126=\"Veränderlich\",K126=\"3. Dekanat\"),10,0)))))))))","v":0},{"$f":"IF(OR(H126=\"1 Widder\",H126=\"5 Löwe\",H126=\"9 Schütze\"),\"Stäbe\",IF(OR(H126=\"2 Stier\",H126=\"6 Jungfrau\",H126=\"10 Steinbock\"),\"Münzen\",IF(OR(H126=\"3 Zwillinge\",H126=\"7 Waage\",H126=\"11 Wassermann\"),\"Schwerter\",IF(OR(H126=\"4 Krebs\",H126=\"8 Skorpion\",H126=\"12 Fische\"),\"Kelche\",0))))","v":0}]
["Zuwendung, die man von anderen erhält. Das Geld, das man sich ",null,null,null,null,{"$f":"IF($B$14=\"11. Haus\",\"9 Mond\",0)","v":0},0,{"$f":"IF(F127<>0,$C$14,0)","v":0},0,{"$f":"IF(H127=\"4 Krebs\",\"Herrscher\",IF(H127=\"2 Stier\",\"Erhöhung\",IF(H127=\"8 Skorpion\",\"Fall\",IF(H127=\"10 Steinbock\",\"Exil\",0))))","v":0},0,0,0,{"$f":"IF(OR(H127=\"1 Widder\",H127=\"5 Löwe\",H127=\"9 Schütze\"),\"Stäbe\",IF(OR(H127=\"2 Stier\",H127=\"6 Jungfrau\",H127=\"10 Steinbock\"),\"Münzen\",IF(OR(H127=\"3 Zwillinge\",H127=\"7 Waage\",H127=\"11 Wassermann\"),\"Schwerter\",IF(OR(H127=\"4 Krebs\",H127=\"8 Skorpion\",H127=\"12 Fische\"),\"Kelche\",0))))","v":0}]
["aus der beruflichen Tätigkeit erarbeitet. Adoptivkinder, Stiefkinder.",null,null,null,null,{"$f":"IF($B$15=\"11. Haus\",\"Uranus\",0)","v":0},0,{"$f":"IF(F128<>0,$C$15,0)","v":0},0,{"$f":"IF(H128=\"11 Wassermann\",\"Herrscher\",IF(H128=\"5 Löwe\",\"Exil\",0))","v":0},0,0,0,{"$f":"IF(OR(H128=\"1 Widder\",H128=\"5 Löwe\",H128=\"9 Schütze\"),\"Stäbe\",IF(OR(H128=\"2 Stier\",H128=\"6 Jungfrau\",H128=\"10 Steinbock\"),\"Münzen\",IF(OR(H128=\"3 Zwillinge\",H128=\"7 Waage\",H128=\"11 Wassermann\"),\"Schwerter\",IF(OR(H128=\"4 Krebs\",H128=\"8 Skorpion\",H128=\"12 Fische\"),\"Kelche\",0))))","v":0}]
[null,null,null,null,null,{"$f":"IF($B$16=\"11. Haus\",\"Neptun\",0)","v":0},0,{"$f":"IF(F129<>0,$C$16,0)","v":0},0,{"$f":"IF(H129=\"12 Fische\",\"Herrscher\",IF(H129=\"6 Jungfrau\",\"Exil\",0))","v":0},0,0,0,0]
[null,null,null,null,null,{"$f":"IF($B$17=\"11. Haus\",\"Pluto\",0)","v":0},0,{"$f":"IF(F130<>0,$C$17,0)","v":0},0,{"$f":"IF(H130=\"8 Skorpion\",\"Herrscher\",IF(H130=\"2 Stier\",\"Exil\",0))","v":0},0,0,0,0]
["12. Haus: i Anonymität und Überpersönliches",{"$f":"H13","v":"3 Zwillinge"},{"$f":"IF(B131=\"1 Widder\",\"4 Der Herrscher\",IF(B131=\"2 Stier\",\"5 Der Hierophant\",IF(B131=\"3 Zwillinge\",\"6 Die Liebenden\",IF(B131=\"4 Krebs\",\"7 Der Wagen\",IF(B131=\"5 Löwe\",\"8 Die Kraft\",IF(B131=\"6 Jungfrau\",\"9 Der Eremit\",IF(B131=\"7 Waage\",\"11 Die Gerechtigkeit\",IF(B131=\"8 Skorpion\",\"13 Der Tod\",IF(B131=\"9 Schütze\",\"14 Die Mässigkeit\",IF(B131=\"10 Steinbock\",\"15 Der Teufel\",IF(B131=\"11 Wassermann\",\"17 Der Stern\",IF(B131=\"12 Fische\",\"18 Der Mond\"))))))))))))","v":"6 Die Liebenden"},{"$f":"IF(B131=\"1 Widder\",\"5 Mars\",IF(B131=\"2 Stier\",\"7 Venus\",IF(B131=\"3 Zwillinge\",\"8 Merkur\",IF(B131=\"4 Krebs\",\"9 Mond\",IF(B131=\"5 Löwe\",\"6 Sonne\",IF(B131=\"6 Jungfrau\",\"8 Merkur\",IF(B131=\"7 Waage\",\"7 Venus\",IF(B131=\"8 Skorpion\",\"5 Mars\",IF(B131=\"9 Schütze\",\"4 Jupiter\",IF(B131=\"10 Steinbock\",\"3 Saturn\",IF(B131=\"11 Wassermann\",\"3 Saturn\",IF(B131=\"12 Fische\",\"4 Jupiter\"))))))))))))","v":"8 Merkur"},{"$f":"IF(D131=\"3 Saturn\",\"21 Die Welt\",IF(D131=\"4 Jupiter\",\"10 Das Rad\",IF(D131=\"5 Mars\",\"16 Der Turm\",IF(D131=\"6 Sonne\",\"19 Die Sonne\",IF(D131=\"7 Venus\",\"3 Die Herrscherin\",IF(D131=\"8 Merkur\",\"1 Der Magier\",IF(D131=\"9 Mond\",\"2 Die Hohepriesterin\",IF(D131=0,0))))))))","v":"1 Der Magier"},{"$f":"IF($B$8=\"12. Haus\",\"3 Saturn\",0)","v":0},0,{"$f":"IF(F131<>0,$C$8,0)","v":0},0,{"$f":"IF(OR(H131=\"10 Steinbock\",H131=\"11 Wassermann\"),\"Herrscher\",IF(H131=\"7 Waage\",\"Erhöhung\",IF(H131=\"1 Widder\",\"Fall\",IF(OR(H131=\"4 Krebs\",H131=\"5 Löwe\"),\"Exil\",0))))","v":0},{"$f":"IF(G131<>0,D8,0)","v":0},0,0,0]
["Ich ersehne. ",null,null,{"$f":"IF(B131=\"8 Skorpion\",\"Pluto\",IF(B131=\"11 Wassermann\",\"Uranus\",IF(B131=\"12 Fische\",\"Neptun\",0)))","v":0},{"$f":"IF(D132=\"Pluto\",\"20 Das Gericht\",IF(D132=\"Uranus\",\"0 Der Narr\",IF(D132=\"Neptun\",\"12 Der Gehängte\",0)))","v":0},{"$f":"IF($B$9=\"12. Haus\",\"4 Jupiter\",0)","v":"4 Jupiter"},"10 Das Rad",{"$f":"IF(F132<>0,$C$9,0)","v":"3 Zwillinge"},"6 Die Liebenden",{"$f":"IF(OR(H132=\"9 Schütze\",H132=\"12 Fische\"),\"Herrscher\",IF(H132=\"4 Krebs\",\"Erhöhung\",IF(H132=\"10 Steinbock\",\"Fall\",IF(OR(H132=\"3 Zwillinge\",H132=\"6 Jungfrau\"),\"Exil\",0))))","v":"Exil"},{"$f":"IF(G132<>0,D9,0)","v":"2. Dekanat"},"Veränderlich",9,"Schwerter"]
["Alles Verborgene, nicht Sichtbare und Unerwartete. Die inneren",null,null,null,null,{"$f":"IF($B$10=\"12. Haus\",\"5 Mars\",0)","v":"5 Mars"},"16 Der Turm",{"$f":"IF(F133<>0,$C$10,0)","v":"4 Krebs"},"7 Der Wagen",{"$f":"IF(OR(H133=\"1 Widder\",H133=\"8 Skorpion\"),\"Herrscher\",IF(H133=\"10 Steinbock\",\"Erhöhung\",IF(H133=\"4 Krebs\",\"Fall\",IF(OR(H133=\"2 Stier\",H133=\"7 Waage\"),\"Exil\",0))))","v":"Fall"},"1. Dekanat","Kardinal",{"$f":"IF(AND(L133=\"Kardinal\",K133=\"1. Dekanat\"),2,IF(AND(L133=\"Kardinal\",K133=\"2. Dekanat\"),3,IF(AND(L133=\"Kardinal\",K133=\"3. Dekanat\"),4,IF(AND(L133=\"Fix\",K133=\"1. Dekanat\"),5,IF(AND(L133=\"Fix\",K133=\"2. Dekanat\"),6,IF(AND(L133=\"Fix\",K133=\"3. Dekanat\"),7,IF(AND(L133=\"Veränderlich\",K133=\"1. Dekanat\"),8,IF(AND(L133=\"Veränderlich\",K133=\"2. Dekanat\"),9,IF(AND(L133=\"Veränderlich\",K133=\"3. Dekanat\"),10,0)))))))))","v":2},"Kelche"]
[" Stärken und Schwächen. Das persönliche und das kollektive ",null,null,null,null,{"$f":"IF($B$11=\"12. Haus\",\"6 Sonne\",0)","v":0},0,{"$f":"IF(F134<>0,$C$11,0)","v":0},0,{"$f":"IF(H134=\"5 Löwe\",\"Herrscher\",0)","v":0},0,0,{"$f":"IF(AND(L134=\"Kardinal\",K134=\"1. Dekanat\"),2,IF(AND(L134=\"Kardinal\",K134=\"2. Dekanat\"),3,IF(AND(L134=\"Kardinal\",K134=\"3. Dekanat\"),4,IF(AND(L134=\"Fix\",K134=\"1. Dekanat\"),5,IF(AND(L134=\"Fix\",K134=\"2. Dekanat\"),6,IF(AND(L134=\"Fix\",K134=\"3. Dekanat\"),7,IF(AND(L134=\"Veränderlich\",K134=\"1. Dekanat\"),8,IF(AND(L134=\"Veränderlich\",K134=\"2. Dekanat\"),9,IF(AND(L134=\"Veränderlich\",K134=\"3. Dekanat\"),10,0)))))))))","v":0},0]
["Unterbewusstsein. Die Einstellung zu den Rollen und Strukturen ",null,null,null,null,{"$f":"IF($B$12=\"12. Haus\",\"7 Venus\",0)","v":"7 Venus"},"3 Die Herrscherin",{"$f":"IF(F135<>0,$C$12,0)","v":"3 Zwillinge"},"6 Die Liebenden",{"$f":"IF(OR(H135=\"2 Stier\",H135=\"7 Waage\"),\"Herrscher\",IF(H135=\"12 Fische\",\"Erhöhung\",IF(H135=\"6 Jungfrau\",\"Fall\",IF(OR(H135=\"8 Skorpion\",H135=\"1 Widder\"),\"Exil\",0))))","v":0},"1. Dekanat","Veränderlich",{"$f":"IF(AND(L135=\"Kardinal\",K135=\"1. Dekanat\"),2,IF(AND(L135=\"Kardinal\",K135=\"2. Dekanat\"),3,IF(AND(L135=\"Kardinal\",K135=\"3. Dekanat\"),4,IF(AND(L135=\"Fix\",K135=\"1. Dekanat\"),5,IF(AND(L135=\"Fix\",K135=\"2. Dekanat\"),6,IF(AND(L135=\"Fix\",K135=\"3. Dekanat\"),7,IF(AND(L135=\"Veränderlich\",K135=\"1. Dekanat\"),8,IF(AND(L135=\"Veränderlich\",K135=\"2. Dekanat\"),9,IF(AND(L135=\"Veränderlich\",K135=\"3. Dekanat\"),10,0)))))))))","v":8},"Schwerter"]
["der Gesellschaft. Sich selber im Weg stehen, Hindernisse, ",null,null,null,null,{"$f":"IF($B$13=\"12. Haus\",\"8 Merkur\",0)","v":"8 Merkur"},"1 Der Magier",{"$f":"IF(F136<>0,$C$13,0)","v":"3 Zwillinge"},"6 Die Liebenden",{"$f":"IF(H136=\"3 Zwillinge\",\"Herrscher\",IF(H136=\"6 Jungfrau\",\"Herrscher u. Erhöhung\",IF(H136=\"12 Fische\",\"Fall u. Exil\",IF(H136=\"9 Schütze\",\"Exil\",0))))","v":"Herrscher"},"1. Dekanat","Veränderlich",{"$f":"IF(AND(L136=\"Kardinal\",K136=\"1. Dekanat\"),2,IF(AND(L136=\"Kardinal\",K136=\"2. Dekanat\"),3,IF(AND(L136=\"Kardinal\",K136=\"3. Dekanat\"),4,IF(AND(L136=\"Fix\",K136=\"1. Dekanat\"),5,IF(AND(L136=\"Fix\",K136=\"2. Dekanat\"),6,IF(AND(L136=\"Fix\",K136=\"3. Dekanat\"),7,IF(AND(L136=\"Veränderlich\",K136=\"1. Dekanat\"),8,IF(AND(L136=\"Veränderlich\",K136=\"2. Dekanat\"),9,IF(AND(L136=\"Veränderlich\",K136=\"3. Dekanat\"),10,0)))))))))","v":8},"Schwerter"]
["Beschränkungen, unerwartete Probleme, Begrenzungen, Karma, ",null,null,null,null,{"$f":"IF($B$14=\"12. Haus\",\"9 Mond\",0)","v":0},0,{"$f":"IF(F137<>0,$C$14,0)","v":0},{"$f":"IF(H137=\"1 Widder\",\"4 Der Herrscher\",IF(H137=\"2 Stier\",\"5 Der Hierophant\",IF(H137=\"3 Zwillinge\",\"6 Die Liebenden\",IF(H137=\"4 Krebs\",\"7 Der Wagen\",IF(H137=\"5 Löwe\",\"8 Die Kraft\",IF(H137=\"6 Jungfrau\",\"9 Der Eremit\",IF(H137=\"7 Waage\",\"11 Die Gerechtigkeit\",IF(H137=\"8 Skorpion\",\"13 Der Tod\",IF(H137=\"9 Schütze\",\"14 Die Mässigkeit\",IF(H137=\"10 Steinbock\",\"15 Der Teufel\",IF(H137=\"11 Wassermann\",\"17 Der Stern\",IF(H137=\"12 Fische\",\"18 Der Mond\",IF(H137=0,0)))))))))))))","v":0},{"$f":"IF(H137=\"4 Krebs\",\"Herrscher\",IF(H137=\"2 Stier\",\"Erhöhung\",IF(H137=\"8 Skorpion\",\"Fall\",IF(H137=\"10 Steinbock\",\"Exil\",0))))","v":0},0,0,{"$f":"IF(AND(L137=\"Kardinal\",K137=\"1. Dekanat\"),2,IF(AND(L137=\"Kardinal\",K137=\"2. Dekanat\"),3,IF(AND(L137=\"Kardinal\",K137=\"3. Dekanat\"),4,IF(AND(L137=\"Fix\",K137=\"1. Dekanat\"),5,IF(AND(L137=\"Fix\",K137=\"2. Dekanat\"),6,IF(AND(L137=\"Fix\",K137=\"3. Dekanat\"),7,IF(AND(L137=\"Veränderlich\",K137=\"1. Dekanat\"),8,IF(AND(L137=\"Veränderlich\",K137=\"2. Dekanat\"),9,IF(AND(L137=\"Veränderlich\",K137=\"3. Dekanat\"),10,0)))))))))","v":0},{"$f":"IF(OR(H137=\"1 Widder\",H137=\"5 Löwe\",H137=\"9 Schütze\"),\"Stäbe\",IF(OR(H137=\"2 Stier\",H137=\"6 Jungfrau\",H137=\"10 Steinbock\"),\"Münzen\",IF(OR(H137=\"3 Zwillinge\",H137=\"7 Waage\",H137=\"11 Wassermann\"),\"Schwerter\",IF(OR(H137=\"4 Krebs\",H137=\"8 Skorpion\",H137=\"12 Fische\"),\"Kelche\",0))))","v":0}]
["Trennung, Einsamkeit. Der Schatten, das Unbewusste, das ",null,null,null,null,{"$f":"IF($B$15=\"12. Haus\",\"Uranus\",0)","v":0},0,{"$f":"IF(F138<>0,$C$15,0)","v":0},{"$f":"IF(H138=\"1 Widder\",\"4 Der Herrscher\",IF(H138=\"2 Stier\",\"5 Der Hierophant\",IF(H138=\"3 Zwillinge\",\"6 Die Liebenden\",IF(H138=\"4 Krebs\",\"7 Der Wagen\",IF(H138=\"5 Löwe\",\"8 Die Kraft\",IF(H138=\"6 Jungfrau\",\"9 Der Eremit\",IF(H138=\"7 Waage\",\"11 Die Gerechtigkeit\",IF(H138=\"8 Skorpion\",\"13 Der Tod\",IF(H138=\"9 Schütze\",\"14 Die Mässigkeit\",IF(H138=\"10 Steinbock\",\"15 Der Teufel\",IF(H138=\"11 Wassermann\",\"17 Der Stern\",IF(H138=\"12 Fische\",\"18 Der Mond\",IF(H138=0,0)))))))))))))","v":0},{"$f":"IF(H138=\"11 Wassermann\",\"Herrscher\",IF(H138=\"5 Löwe\",\"Exil\",0))","v":0},0,0,{"$f":"IF(AND(L138=\"Kardinal\",K138=\"1. Dekanat\"),2,IF(AND(L138=\"Kardinal\",K138=\"2. Dekanat\"),3,IF(AND(L138=\"Kardinal\",K138=\"3. Dekanat\"),4,IF(AND(L138=\"Fix\",K138=\"1. Dekanat\"),5,IF(AND(L138=\"Fix\",K138=\"2. Dekanat\"),6,IF(AND(L138=\"Fix\",K138=\"3. Dekanat\"),7,IF(AND(L138=\"Veränderlich\",K138=\"1. Dekanat\"),8,IF(AND(L138=\"Veränderlich\",K138=\"2. Dekanat\"),9,IF(AND(L138=\"Veränderlich\",K138=\"3. Dekanat\"),10,0)))))))))","v":0},0]
["Verdrängte. Transzendenz, Spiritualität, Okkultismus, Medialität. ",null,null,null,null,{"$f":"IF($B$16=\"12. Haus\",\"Neptun\",0)","v":0},0,{"$f":"IF(F139<>0,$C$16,0)","v":0},0,{"$f":"IF(H139=\"12 Fische\",\"Herrscher\",IF(H139=\"6 Jungfrau\",\"Exil\",0))","v":0},0,0,0,0]
["Institutionen wie Krankenhäuser, Sanatorien und Gefängnisse. ",null,null,null,null,{"$f":"IF($B$17=\"12. Haus\",\"Pluto\",0)","v":0},0,{"$f":"IF(F140<>0,$C$17,0)","v":0},0,{"$f":"IF(H140=\"8 Skorpion\",\"Herrscher\",IF(H140=\"2 Stier\",\"Exil\",0))","v":0},0,0,0,0]
["Hoffnungen und Ängste. Sehnsucht, Erlösung, Geheimnisse. "]
["Übersinnliche und mystische Erfahrungen, Realitätsflucht, "]
["Rückzug, Drogen, will aus dem Körpergefängnis fliehen. Freiwillige "]
["und erzwungene Isolation. Heimliche Feinde und grosse Tiere. "]
["Heimliche Affären, alles, was man versteckt und geheimhalten will. Wohltätigkeit, "]
["Mitgefühl. Kreativität, Kunst. "]

{"sheet":"Astrologie 2","index":10,"n_rows":21,"n_cols":9,"rows_kept":21,"cut":false,"hidden":false,"merged":[]}
[]
[]
["Die astrologischen Karten für",{"$f":"Jahreskarten!E8","v":"Zum "},{"$f":"Jahreskarten!F8","v":"Beispiel"}]
["Geben Sie die Informationen aus Ihrem Horoskop auf dem Blatt \"Astrologie 1\" ein."]
["Die zu interpretierenden Karten sind violett markiert."]
[]
[null,null,"Sternzeichen","Karte","Wert 1","Wert 2","Wert 3","Mond",{"$f":"'Astrologie 1'!C14","v":"6 Jungfrau"}]
["Die Karte der Individualität","Die Position der Sonne",{"$f":" 'Astrologie 1'!C11","v":"2 Stier"},{"$f":"IF(C8=\"1 Widder\",\"4 Der Herrscher\",IF(C8=\"2 Stier\",\"5 Der Hierophant\",IF(C8=\"3 Zwillinge\",\"6 Die Liebenden\",IF(C8=\"4 Krebs\",\"7 Der Wagen\",IF(C8=\"5 Löwe\",\"8 Die Kraft\",IF(C8=\"6 Jungfrau\",\"9 Der Eremit\",IF(C8=\"7 Waage\",\"11 Die Gerechtigkeit\",IF(C8=\"8 Skorpion\",\"13 Der Tod\",IF(C8=\"9 Schütze\",\"14 Die Mässigkeit\",IF(C8=\"10 Steinbock\",\"15 Der Teufel\",IF(C8=\"11 Wassermann\",\"17 Der Stern\",IF(C8=\"12 Fische\",\"18 Der Mond\"))))))))))))","v":"5 Der Hierophant"},{"$f":"IF(D8=\"4 Der Herrscher\",4,IF(D8=\"5 Der Hierophant\",5,IF(D8=\"6 Die Liebenden\",6,IF(D8=\"7 Der Wagen\",7,IF(D8=\"8 Die Kraft\",8,IF(D8=\"9 Der Eremit\",9,IF(D8=\"11 Die Gerechtigkeit\",11,IF(D8=\"13 Der Tod\",13,IF(D8=\"14 Die Mässigkeit\",14,IF(D8=\"15 Der Teufel\",15,IF(D8=\"17 Der Stern\",17,IF(D8=\"18 Der Mond\",18))))))))))))","v":5}]
["Die Karte der Persönlichkeit","Die Position des Aszendenten",{"$f":"'Astrologie 1'!F8","v":"4 Krebs"},{"$f":"IF(C9=\"1 Widder\",\"4 Der Herrscher\",IF(C9=\"2 Stier\",\"5 Der Hierophant\",IF(C9=\"3 Zwillinge\",\"6 Die Liebenden\",IF(C9=\"4 Krebs\",\"7 Der Wagen\",IF(C9=\"5 Löwe\",\"8 Die Kraft\",IF(C9=\"6 Jungfrau\",\"9 Der Eremit\",IF(C9=\"7 Waage\",\"11 Die Gerechtigkeit\",IF(C9=\"8 Skorpion\",\"13 Der Tod\",IF(C9=\"9 Schütze\",\"14 Die Mässigkeit\",IF(C9=\"10 Steinbock\",\"15 Der Teufel\",IF(C9=\"11 Wassermann\",\"17 Der Stern\",IF(C9=\"12 Fische\",\"18 Der Mond\"))))))))))))","v":"7 Der Wagen"},{"$f":"IF(D9=\"4 Der Herrscher\",4,IF(D9=\"5 Der Hierophant\",5,IF(D9=\"6 Die Liebenden\",6,IF(D9=\"7 Der Wagen\",7,IF(D9=\"8 Die Kraft\",8,IF(D9=\"9 Der Eremit\",9,IF(D9=\"11 Die Gerechtigkeit\",11,IF(D9=\"13 Der Tod\",13,IF(D9=\"14 Die Mässigkeit\",14,IF(D9=\"15 Der Teufel\",15,IF(D9=\"17 Der Stern\",17,IF(D9=\"18 Der Mond\",18))))))))))))","v":7},null,null,"Dekanat Sonne",{"$f":"'Astrologie 1'!D11","v":"3. Dekanat"}]
[null,null,null,null,null,null,null,"Dekanat Mond",{"$f":"'Astrologie 1'!D14","v":"3. Dekanat"}]
["Die Karten der Problemlösung:",null,null,null,null,null,null,"Dekanat Aszendent",{"$f":"'Astrologie 1'!I8","v":"2. Dekanat"}]
["Die Karte des Problems","Karten der Individualität + Persönlichkeit",{"$f":"F12","v":12},{"$f":"IF(C12=1,\"Der Magier\",IF(C12=2,\"Die Hohepriesterin\",IF(C12=3,\"Die Herrscherin\",IF(C12=4,\"Der Herrscher\",IF(C12=5,\"Der Hierophant\",IF(C12=6,\"Die Liebenden\",IF(C12=7,\"Der Wagen\",IF(C12=8,\"Die Kraft\",IF(C12=9,\"Der Eremit\",IF(C12=10,\"Das Rad\",IF(C12=11,\"Die Gerechtigkeit\",IF(C12=12,\"Der Gehängte\",IF(C12=13,\"Der Tod\",IF(C12=14,\"Die Mässigkeit\",IF(C12=15,\"Der Teufel\",IF(C12=16,\"Der Turm\",IF(C12=17,\"Der Stern\",IF(C12=18,\"Der Mond\",IF(C12=19,\"Die Sonne\",IF(C12=20,\"Das Gericht\",IF(C12=21,\"Die Welt\",IF(C12=22,\"Der Narr\"))))))))))))))))))))))","v":"Der Gehängte"},{"$f":"SUM(E8+E9)","v":12},{"$f":"IF(E12>22,SUMPRODUCT(VALUE(MID(E12,ROW(INDIRECT(\"$b1:$A\"&LEN(E12))),1))),E12)","v":12}]
["Die Karte der Lösung des Problems","Karten der Individualität - Persönlichkeit",{"$f":"F13","v":2},{"$f":"IF(C13=1,\"Der Magier\",IF(C13=2,\"Die Hohepriesterin\",IF(C13=3,\"Die Herrscherin\",IF(C13=4,\"Der Herrscher\",IF(C13=5,\"Der Hierophant\",IF(C13=6,\"Die Liebenden\",IF(C13=7,\"Der Wagen\",IF(C13=8,\"Die Kraft\",IF(C13=9,\"Der Eremit\",IF(C13=10,\"Das Rad\",IF(C13=11,\"Die Gerechtigkeit\",IF(C13=12,\"Der Gehängte\",IF(C13=13,\"Der Tod\",IF(C13=14,\"Die Mässigkeit\",IF(C13=15,\"Der Teufel\",IF(C13=16,\"Der Turm\",IF(C13=17,\"Der Stern\",IF(C13=18,\"Der Mond\",IF(C13=19,\"Die Sonne\",IF(C13=20,\"Das Gericht\",IF(C13=21,\"Die Welt\",IF(C13=22,\"Der Narr\",IF(C13=0,\"Der Narr\")))))))))))))))))))))))","v":"Die Hohepriesterin"},{"$f":"SUM(E8-E9)","v":-2},{"$f":"ABS(E13)","v":2}]
["Die Hilfskarte","Karte des Problems - Lösung des Problems",{"$f":"F14","v":10},{"$f":"IF(C14=1,\"Der Magier\",IF(C14=2,\"Die Hohepriesterin\",IF(C14=3,\"Die Herrscherin\",IF(C14=4,\"Der Herrscher\",IF(C14=5,\"Der Hierophant\",IF(C14=6,\"Die Liebenden\",IF(C14=7,\"Der Wagen\",IF(C14=8,\"Die Kraft\",IF(C14=9,\"Der Eremit\",IF(C14=10,\"Das Rad\",IF(C14=11,\"Die Gerechtigkeit\",IF(C14=12,\"Der Gehängte\",IF(C14=13,\"Der Tod\",IF(C14=14,\"Die Mässigkeit\",IF(C14=15,\"Der Teufel\",IF(C14=16,\"Der Turm\",IF(C14=17,\"Der Stern\",IF(C14=18,\"Der Mond\",IF(C14=19,\"Die Sonne\",IF(C14=20,\"Das Gericht\",IF(C14=21,\"Die Welt\",IF(C14=22,\"Der Narr\",IF(C14=0,\"Der Narr\")))))))))))))))))))))))","v":"Das Rad"},{"$f":"SUM(F12-F13)","v":10},{"$f":"ABS(E14)","v":10}]
["Die Karte der Integration","Alle Karten addiert",{"$f":"G15","v":9},{"$f":"IF(C15=1,\"Der Magier\",IF(C15=2,\"Die Hohepriesterin\",IF(C15=3,\"Die Herrscherin\",IF(C15=4,\"Der Herrscher\",IF(C15=5,\"Der Hierophant\",IF(C15=6,\"Die Liebenden\",IF(C15=7,\"Der Wagen\",IF(C15=8,\"Die Kraft\",IF(C15=9,\"Der Eremit\",IF(C15=10,\"Das Rad\",IF(C15=11,\"Die Gerechtigkeit\",IF(C15=12,\"Der Gehängte\",IF(C15=13,\"Der Tod\",IF(C15=14,\"Die Mässigkeit\",IF(C15=15,\"Der Teufel\",IF(C15=16,\"Der Turm\",IF(C15=17,\"Der Stern\",IF(C15=18,\"Der Mond\",IF(C15=19,\"Die Sonne\",IF(C15=20,\"Das Gericht\",IF(C15=21,\"Die Welt\",IF(C15=22,\"Der Narr\",IF(C15=0,\"Der Narr\")))))))))))))))))))))))","v":"Der Eremit"},null,{"$f":"SUM(E8+E9+F12+F13+F14)","v":36},{"$f":"IF(F15>22,SUMPRODUCT(VALUE(MID(F15,ROW(INDIRECT(\"$b1:$A\"&LEN(F15))),1))),F15)","v":9}]
[]
["Die Schicksalskarte",{"$f":"C8","v":"2 Stier"},{"$f":"IF(AND(E17=\"Kardinal\",I9=\"1. Dekanat\"),2,IF(AND(E17=\"Kardinal\",I9=\"2. Dekanat\"),3,IF(AND(E17=\"Kardinal\",I9=\"3. Dekanat\"),4,IF(AND(E17=\"Fix\",I9=\"1. Dekanat\"),5,IF(AND(E17=\"Fix\",I9=\"2. Dekanat\"),6,IF(AND(E17=\"Fix\",I9=\"3. Dekanat\"),7,IF(AND(E17=\"Veränderlich\",I9=\"1. Dekanat\"),8,IF(AND(E17=\"Veränderlich\",I9=\"2. Dekanat\"),9,IF(AND(E17=\"Veränderlich\",I9=\"3. Dekanat\"),10)))))))))","v":7},{"$f":"IF(OR(B17=\"1 Widder\",B17=\"5 Löwe\",B17=\"9 Schütze\"),\"Stäbe\",IF(OR(B17=\"2 Stier\",B17=\"6 Jungfrau\",B17=\"10 Steinbock\"),\"Münzen\",IF(OR(B17=\"3 Zwillinge\",B17=\"7 Waage\",B17=\"11 Wassermann\"),\"Schwerter\",IF(OR(B17=\"4 Krebs\",B17=\"8 Skorpion\",B17=\"12 Fische\"),\"Kelche\",0))))","v":"Münzen"},{"$f":"IF(OR(B17=\"1 Widder\",B17=\"7 Waage\",B17=\"10 Steinbock\",B17=\"4 Krebs\"),\"Kardinal\",IF(OR(B17=\"2 Stier\",B17=\"5 Löwe\",B17=\"8 Skorpion\",B17=\"11 Wassermann\"),\"Fix\",IF(OR(B17=\"3 Zwillinge\",B17=\"6 Jungfrau\",B17=\"9 Schütze\",B17=\"12 Fische\"),\"Veränderlich\")))","v":"Fix"}]
["Die Personenkarten:","Sternzeichen"]
["Die Karte des persönlichen Potentials",{"$f":"C8","v":"2 Stier"},{"$f":"IF(AND(E19=\"Kardinal\",I9=\"1. Dekanat\"),\"Königin\",IF(AND(E19=\"Kardinal\",I9=\"2. Dekanat\"),\"Königin\",IF(AND(E19=\"Kardinal\",I9=\"3. Dekanat\"),\"Ritter\",IF(AND(E19=\"Fix\",I9=\"1. Dekanat\"),\"Ritter\",IF(AND(E19=\"Fix\",I9=\"2. Dekanat\"),\"Ritter\",IF(AND(E19=\"Fix\",I9=\"3. Dekanat\"),\"König\",IF(AND(E19=\"Veränderlich\",I9=\"1. Dekanat\"),\"König\",IF(AND(E19=\"Veränderlich\",I9=\"2. Dekanat\"),\"König\",IF(AND(E19=\"Veränderlich\",I9=\"3. Dekanat\"),\"Königin\",0)))))))))","v":"König"},{"$f":"IF(AND(B19=\"1 Widder\",I9<>\"3. Dekanat\"),Stäbe,IF(AND(B19=\"1 Widder\",I9=\"3. Dekanat\"),\"Münzen\",IF(AND(B19=\"2 Stier\",I9<>\"3. Dekanat\"),\"Münzen\",IF(AND(B19=\"2 Stier\",I9=\"3. Dekanat\"),\"Schwerter\",IF(AND(B19=\"3 Zwillinge\",I9<>\"3. Dekanat\"),\"Schwerter\",IF(AND(B19=\"3 Zwillinge\",I9=\"3. Dekanat\"),\"Kelche\",IF(AND(B19=\"4 Krebs\",I9<>\"3. Dekanat\"),\"Kelche\",IF(AND(B19=\"4 Krebs\",I9=\"3. Dekanat\"),\"Stäbe\",IF(AND(B19=\"5 Löwe\",I9<>\"3. Dekanat\"),\"Stäbe\",IF(AND(B19=\"5 Löwe\",I9=\"3. Dekanat\"),\"Münzen\",IF(AND(B19=\"6 Jungfrau\",I9<>\"3. Dekanat\"),\"Münzen\",IF(AND(B19=\"6 Jungfrau\",I9=\"3. Dekanat\"),\"Schwerter\",IF(AND(B19=\"7 Waage\",I9<>\"3. Dekanat\"),\"Schwerter\",IF(AND(B19=\"7 Waage\",I9=\"3. Dekanat\"),\"Kelche\",IF(AND(B19=\"8 Skorpion\",I9<>\"3. Dekanat\"),\"Kelche\",IF(AND(B19=\"8 Skorpion\",I9=\"3. Dekanat\"),\"Stäbe\",IF(AND(B19=\"9 Schütze\",I9<>\"3. Dekanat\"),\"Stäbe\",IF(AND(B19=\"9 Schütze\",I9=\"3. Dekanat\"),\"Münzen\",IF(AND(B19=\"10 Steinbock\",I9<>\"3. Dekanat\"),\"Münzen\",IF(AND(B19=\"10 Steinbock\",I9=\"3. Dekanat\"),\"Schwerter\",IF(AND(B19=\"11 Wassermann\",I9<>\"3. Dekanat\"),\"Schwerter\",IF(AND(B19=\"11 Wassermann\",I9=\"3. Dekanat\"),\"Kelche\",IF(AND(B19=\"12 Fische\",I9<>\"3. Dekanat\"),\"Kelche\",IF(AND(B19=\"12 Fische\",I9=\"3. Dekanat\"),\"Stäbe\"))))))))))))))))))))))))","v":"Schwerter"},{"$f":"IF(OR(B19=\"1 Widder\",B19=\"7 Waage\",B19=\"10 Steinbock\",B19=\"4 Krebs\"),\"Kardinal\",IF(OR(B19=\"2 Stier\",B19=\"5 Löwe\",B19=\"8 Skorpion\",B19=\"11 Wassermann\"),\"Fix\",IF(OR(B19=\"3 Zwillinge\",B19=\"6 Jungfrau\",B19=\"9 Schütze\",B19=\"12 Fische\"),\"Veränderlich\")))","v":"Fix"}]
["Die Karte des inneren Lehrers",{"$f":"I7","v":"6 Jungfrau"},{"$f":"IF(AND(E20=\"Kardinal\",I10=\"1. Dekanat\"),\"Königin\",IF(AND(E20=\"Kardinal\",I10=\"2. Dekanat\"),\"Königin\",IF(AND(E20=\"Kardinal\",I10=\"3. Dekanat\"),\"Ritter\",IF(AND(E20=\"Fix\",I10=\"1. Dekanat\"),\"Ritter\",IF(AND(E20=\"Fix\",I10=\"2. Dekanat\"),\"Ritter\",IF(AND(E20=\"Fix\",I10=\"3. Dekanat\"),\"König\",IF(AND(E20=\"Veränderlich\",I10=\"1. Dekanat\"),\"König\",IF(AND(E20=\"Veränderlich\",I10=\"2. Dekanat\"),\"König\",IF(AND(E20=\"Veränderlich\",I10=\"3. Dekanat\"),\"Königin\",0)))))))))","v":"Königin"},{"$f":"IF(AND(B20=\"1 Widder\",I10<>\"3. Dekanat\"),Stäbe,IF(AND(B20=\"1 Widder\",I10=\"3. Dekanat\"),\"Münzen\",IF(AND(B20=\"2 Stier\",I10<>\"3. Dekanat\"),\"Münzen\",IF(AND(B20=\"2 Stier\",I10=\"3. Dekanat\"),\"Schwerter\",IF(AND(B20=\"3 Zwillinge\",I10<>\"3. Dekanat\"),\"Schwerter\",IF(AND(B20=\"3 Zwillinge\",I10=\"3. Dekanat\"),\"Kelche\",IF(AND(B20=\"4 Krebs\",I10<>\"3. Dekanat\"),\"Kelche\",IF(AND(B20=\"4 Krebs\",I10=\"3. Dekanat\"),\"Stäbe\",IF(AND(B20=\"5 Löwe\",I10<>\"3. Dekanat\"),\"Stäbe\",IF(AND(B20=\"5 Löwe\",I10=\"3. Dekanat\"),\"Münzen\",IF(AND(B20=\"6 Jungfrau\",I10<>\"3. Dekanat\"),\"Münzen\",IF(AND(B20=\"6 Jungfrau\",I10=\"3. Dekanat\"),\"Schwerter\",IF(AND(B20=\"7 Waage\",I10<>\"3. Dekanat\"),\"Schwerter\",IF(AND(B20=\"7 Waage\",I10=\"3. Dekanat\"),\"Kelche\",IF(AND(B20=\"8 Skorpion\",I10<>\"3. Dekanat\"),\"Kelche\",IF(AND(B20=\"8 Skorpion\",I10=\"3. Dekanat\"),\"Stäbe\",IF(AND(B20=\"9 Schütze\",I10<>\"3. Dekanat\"),\"Stäbe\",IF(AND(B20=\"9 Schütze\",I10=\"3. Dekanat\"),\"Münzen\",IF(AND(B20=\"10 Steinbock\",I10<>\"3. Dekanat\"),\"Münzen\",IF(AND(B20=\"10 Steinbock\",I10=\"3. Dekanat\"),\"Schwerter\",IF(AND(B20=\"11 Wassermann\",I10<>\"3. Dekanat\"),\"Schwerter\",IF(AND(B20=\"11 Wassermann\",I10=\"3. Dekanat\"),\"Kelche\",IF(AND(B20=\"12 Fische\",I10<>\"3. Dekanat\"),\"Kelche\",IF(AND(B20=\"12 Fische\",I10=\"3. Dekanat\"),\"Stäbe\"))))))))))))))))))))))))","v":"Schwerter"},{"$f":"IF(OR(B20=\"1 Widder\",B20=\"7 Waage\",B20=\"10 Steinbock\",B20=\"4 Krebs\"),\"Kardinal\",IF(OR(B20=\"2 Stier\",B20=\"5 Löwe\",B20=\"8 Skorpion\",B20=\"11 Wassermann\"),\"Fix\",IF(OR(B20=\"3 Zwillinge\",B20=\"6 Jungfrau\",B20=\"9 Schütze\",B20=\"12 Fische\"),\"Veränderlich\")))","v":"Veränderlich"}]
["Die Karte des äusseren Ausdrucks",{"$f":"C9","v":"4 Krebs"},{"$f":"IF(AND(E21=\"Kardinal\",I11=\"1. Dekanat\"),\"Königin\",IF(AND(E21=\"Kardinal\",I11=\"2. Dekanat\"),\"Königin\",IF(AND(E21=\"Kardinal\",I11=\"3. Dekanat\"),\"Ritter\",IF(AND(E21=\"Fix\",I11=\"1. Dekanat\"),\"Ritter\",IF(AND(E21=\"Fix\",I11=\"2. Dekanat\"),\"Ritter\",IF(AND(E21=\"Fix\",I11=\"3. Dekanat\"),\"König\",IF(AND(E21=\"Veränderlich\",I11=\"1. Dekanat\"),\"König\",IF(AND(E21=\"Veränderlich\",I11=\"2. Dekanat\"),\"König\",IF(AND(E21=\"Veränderlich\",I11=\"3. Dekanat\"),\"Königin\",0)))))))))","v":"Königin"},{"$f":"IF(AND(B21=\"1 Widder\",I11<>\"3. Dekanat\"),Stäbe,IF(AND(B21=\"1 Widder\",I11=\"3. Dekanat\"),\"Münzen\",IF(AND(B21=\"2 Stier\",I11<>\"3. Dekanat\"),\"Münzen\",IF(AND(B21=\"2 Stier\",I11=\"3. Dekanat\"),\"Schwerter\",IF(AND(B21=\"3 Zwillinge\",I11<>\"3. Dekanat\"),\"Schwerter\",IF(AND(B21=\"3 Zwillinge\",I11=\"3. Dekanat\"),\"Kelche\",IF(AND(B21=\"4 Krebs\",I11<>\"3. Dekanat\"),\"Kelche\",IF(AND(B21=\"4 Krebs\",I11=\"3. Dekanat\"),\"Stäbe\",IF(AND(B21=\"5 Löwe\",I11<>\"3. Dekanat\"),\"Stäbe\",IF(AND(B21=\"5 Löwe\",I11=\"3. Dekanat\"),\"Münzen\",IF(AND(B21=\"6 Jungfrau\",I11<>\"3. Dekanat\"),\"Münzen\",IF(AND(B21=\"6 Jungfrau\",I11=\"3. Dekanat\"),\"Schwerter\",IF(AND(B21=\"7 Waage\",I11<>\"3. Dekanat\"),\"Schwerter\",IF(AND(B21=\"7 Waage\",I11=\"3. Dekanat\"),\"Kelche\",IF(AND(B21=\"8 Skorpion\",I11<>\"3. Dekanat\"),\"Kelche\",IF(AND(B21=\"8 Skorpion\",I11=\"3. Dekanat\"),\"Stäbe\",IF(AND(B21=\"9 Schütze\",I11<>\"3. Dekanat\"),\"Stäbe\",IF(AND(B21=\"9 Schütze\",I11=\"3. Dekanat\"),\"Münzen\",IF(AND(B21=\"10 Steinbock\",I11<>\"3. Dekanat\"),\"Münzen\",IF(AND(B21=\"10 Steinbock\",I11=\"3. Dekanat\"),\"Schwerter\",IF(AND(B21=\"11 Wassermann\",I11<>\"3. Dekanat\"),\"Schwerter\",IF(AND(B21=\"11 Wassermann\",I11=\"3. Dekanat\"),\"Kelche\",IF(AND(B21=\"12 Fische\",I11<>\"3. Dekanat\"),\"Kelche\",IF(AND(B21=\"12 Fische\",I11=\"3. Dekanat\"),\"Stäbe\"))))))))))))))))))))))))","v":"Kelche"},{"$f":"IF(OR(B21=\"1 Widder\",B21=\"7 Waage\",B21=\"10 Steinbock\",B21=\"4 Krebs\"),\"Kardinal\",IF(OR(B21=\"2 Stier\",B21=\"5 Löwe\",B21=\"8 Skorpion\",B21=\"11 Wassermann\"),\"Fix\",IF(OR(B21=\"3 Zwillinge\",B21=\"6 Jungfrau\",B21=\"9 Schütze\",B21=\"12 Fische\"),\"Veränderlich\")))","v":"Kardinal"}]

{"sheet":"Tabelle2","index":11,"n_rows":132,"n_cols":9,"rows_kept":132,"cut":false,"hidden":true,"merged":[]}
[]
[]
[]
["Geburtsdatum"]
["Jahr","Monat","Tag","Alter","Quersumme Jahr","Quersumme Monat","Quersumme Tag","Quersumme","Karte"]
[1961,2,21,0,{"$f":"SUMPRODUCT(MID(A6,ROW(INDIRECT(\"1:\"&LEN(A6))),1)*1)","v":17},{"$f":"SUMPRODUCT(MID(B6,ROW(INDIRECT(\"1:\"&LEN(B6))),1)*1)","v":2},{"$f":"SUMPRODUCT(MID(C6,ROW(INDIRECT(\"1:\"&LEN(C6))),1)*1)","v":3},{"$f":"SUM(E6:G6)","v":22},{"$f":"IF(H6>22,SUMPRODUCT(VALUE(MID(H6,ROW(INDIRECT(\"$b1:$A\"&LEN(H6))),1))),H6)","v":22}]
[{"$f":"$A$6+D7","v":1962},{"$f":"$B$6","v":2},{"$f":"$C$6","v":21},1,{"$f":"SUMPRODUCT(MID(A7,ROW(INDIRECT(\"1:\"&LEN(A7))),1)*1)","v":18},{"$f":"$F$6","v":2},{"$f":"$G$6","v":3},{"$f":"SUM(E7:G7)","v":23},{"$f":"IF(H7>22,SUMPRODUCT(VALUE(MID(H7,ROW(INDIRECT(\"$b1:$A\"&LEN(H7))),1))),H7)","v":5}]
[{"$f":"$A$6+D8","v":1963},{"$f":"$B$6","v":2},{"$f":"$C$6","v":21},2,19,{"$f":"$F$6","v":2},{"$f":"$G$6","v":3},24,6]
[1964,2,21,3,20,2,3,25,7]
[1965,2,21,4,21,2,3,26,8]
[1966,2,21,5,22,2,3,27,9]
[1967,2,21,6,23,2,3,28,10]
[1968,2,21,7,24,2,3,29,11]
[1969,2,21,8,25,2,3,30,3]
[1970,2,21,9,17,2,3,22,22]
[1971,2,21,10,18,2,3,23,5]
[1972,2,21,11,19,2,3,24,6]
[1973,2,21,12,20,2,3,25,7]
[1974,2,21,13,21,2,3,26,8]
[1975,2,21,14,22,2,3,27,9]
[1976,2,21,15,23,2,3,28,10]
[1977,2,21,16,24,2,3,29,11]
[1978,2,21,17,25,2,3,30,3]
[1979,2,21,18,26,2,3,31,4]
[1980,2,21,19,18,2,3,23,5]
[1981,2,21,20,19,2,3,24,6]
[1982,2,21,21,20,2,3,25,7]
[1983,2,21,22,21,2,3,26,8]
[1984,2,21,23,22,2,3,27,9]
[1985,2,21,24,23,2,3,28,10]
[1986,2,21,25,24,2,3,29,11]
[1987,2,21,26,25,2,3,30,3]
[1988,2,21,27,26,2,3,31,4]
[1989,2,21,28,27,2,3,32,5]
[1990,2,21,29,19,2,3,24,6]
[1991,2,21,30,20,2,3,25,7]
[1992,2,21,31,21,2,3,26,8]
[1993,2,21,32,22,2,3,27,9]
[1994,2,21,33,23,2,3,28,10]
[1995,2,21,34,24,2,3,29,11]
[1996,2,21,35,25,2,3,30,3]
[1997,2,21,36,26,2,3,31,4]
[1998,2,21,37,27,2,3,32,5]
[1999,2,21,38,28,2,3,33,6]
[2000,2,21,39,2,2,3,7,7]
[2001,2,21,40,3,2,3,8,8]
[2002,2,21,41,4,2,3,9,9]
[2003,2,21,42,5,2,3,10,10]
[2004,2,21,43,6,2,3,11,11]
[2005,2,21,44,7,2,3,12,12]
[2006,2,21,45,8,2,3,13,13]
[2007,2,21,46,9,2,3,14,14]
[2008,2,21,47,10,2,3,15,15]
[2009,2,21,48,11,2,3,16,16]
[2010,2,21,49,3,2,3,8,8]
[2011,2,21,50,4,2,3,9,9]
[2012,2,21,51,5,2,3,10,10]
[2013,2,21,52,6,2,3,11,11]
[2014,2,21,53,7,2,3,12,12]
[2015,2,21,54,8,2,3,13,13]
[2016,2,21,55,9,2,3,14,14]
[2017,2,21,56,10,2,3,15,15]
[2018,2,21,57,11,2,3,16,16]
[2019,2,21,58,12,2,3,17,17]
[2020,2,21,59,4,2,3,9,9]
[2021,2,21,60,5,2,3,10,10]
[2022,2,21,61,6,2,3,11,11]
[2023,2,21,62,7,2,3,12,12]
[2024,2,21,63,8,2,3,13,13]
[2025,2,21,64,9,2,3,14,14]
[2026,2,21,65,{"$f":"SUMPRODUCT(MID(A71,ROW(INDIRECT(\"1:\"&LEN(A71))),1)*1)","v":10},2,3,{"$f":"SUM(E71:G71)","v":15},{"$f":"IF(H71>22,SUMPRODUCT(VALUE(MID(H71,ROW(INDIRECT(\"$b1:$A\"&LEN(H71))),1))),H71)","v":15}]
[{"$f":"$A$6+D72","v":2027},{"$f":"$B$6","v":2},{"$f":"$C$6","v":21},66,11,{"$f":"$F$6","v":2},{"$f":"$G$6","v":3},16,16]
[2028,2,21,67,12,2,3,17,17]
[2029,2,21,68,13,2,3,18,18]
[2030,2,21,69,5,2,3,10,10]
[2031,2,21,70,6,2,3,11,11]
[2032,2,21,71,7,2,3,12,12]
[2033,2,21,72,8,2,3,13,13]
[2034,2,21,73,9,2,3,14,14]
[2035,2,21,74,10,2,3,15,15]
[2036,2,21,75,11,2,3,16,16]
[2037,2,21,76,12,2,3,17,17]
[2038,2,21,77,13,2,3,18,18]
[2039,2,21,78,14,2,3,19,19]
[2040,2,21,79,6,2,3,11,11]
[2041,2,21,80,7,2,3,12,12]
[2042,2,21,81,8,2,3,13,13]
[2043,2,21,82,9,2,3,14,14]
[2044,2,21,83,10,2,3,15,15]
[2045,2,21,84,11,2,3,16,16]
[2046,2,21,85,12,2,3,17,17]
[2047,2,21,86,13,2,3,18,18]
[2048,2,21,87,14,2,3,19,19]
[2049,2,21,88,15,2,3,20,20]
[2050,2,21,89,7,2,3,12,12]
[2051,2,21,90,8,2,3,13,13]
[2052,2,21,91,9,2,3,14,14]
[2053,2,21,92,10,2,3,15,15]
[2054,2,21,93,11,2,3,16,16]
[2055,2,21,94,12,2,3,17,17]
[2056,2,21,95,13,2,3,18,18]
[2057,2,21,96,14,2,3,19,19]
[2058,2,21,97,15,2,3,20,20]
[2059,2,21,98,16,2,3,21,21]
[2060,2,21,99,8,2,3,13,13]
[]
[]
[]
[]
["Die Häufigkeit der Karten"]
["1 Der Magier",{"$f":"COUNTIF($I$6:$I$105,1)","v":0}]
["2 Die Hohepriesterin",{"$f":"COUNTIF($I$6:$I$105,2)","v":0}]
["3 Die Herrscherin",{"$f":"COUNTIF($I$6:$I$105,3)","v":4}]
["4 Der Herrscher",{"$f":"COUNTIF($I$6:$I$105,4)","v":3}]
["5 Der Hierophant",{"$f":"COUNTIF($I$6:$I$105,5)","v":5}]
["6 Die Liebenden",{"$f":"COUNTIF($I$6:$I$105,6)","v":5}]
["7 Der Wagen",{"$f":"COUNTIF($I$6:$I$105,7)","v":5}]
["8 Die Kraft",{"$f":"COUNTIF($I$6:$I$105,8)","v":6}]
["9 Der Eremit",{"$f":"COUNTIF($I$6:$I$105,9)","v":7}]
["10 Das Rad des Schicksals",{"$f":"COUNTIF($I$6:$I$105,10)","v":8}]
["11 Die Gerechtigkeit",{"$f":"COUNTIF($I$6:$I$105,11)","v":9}]
["12 Der Gehängte",{"$f":"COUNTIF($I$6:$I$105,12)","v":6}]
["13 Der Tod",{"$f":"COUNTIF($I$6:$I$105,13)","v":7}]
["14 Die Mässigkeit",{"$f":"COUNTIF($I$6:$I$105,14)","v":6}]
["15 Der Teufel",{"$f":"COUNTIF($I$6:$I$105,15)","v":6}]
["16 Der Turm",{"$f":"COUNTIF($I$6:$I$105,16)","v":6}]
["17 Der Stern",{"$f":"COUNTIF($I$6:$I$105,17)","v":5}]
["18 Der Mond",{"$f":"COUNTIF($I$6:$I$105,18)","v":4}]
["19 Die Sonne",{"$f":"COUNTIF($I$6:$I$105,19)","v":3}]
["20 Das Gericht",{"$f":"COUNTIF($I$6:$I$105,20)","v":2}]
["21 Die Welt",{"$f":"COUNTIF($I$6:$I$105,21)","v":1}]
["22 Der Narr",{"$f":"COUNTIF($I$6:$I$105,22)","v":2}]